{"text_format":"1","workbook":"xlsx","n_sheets":11,"sheets":["General Information","Summary Data Sense Check Sheet","Workload Guidance Notes","Workload Data Entry","Staffing and Finance Guidance","Staffing and Finance Data Entry","AfC Spine Data","lists","Turnaround Times","Consultant Pay","Data Export"],"not_rendered":{"charts":0,"images":9,"macros":1,"external_links":0,"defined_names":23,"comments":0,"pivot_tables":0},"unopened":[],"bounds":{"document_bytes":16777216,"sheet_cells":100000,"rows_first":2000,"rows_last":500,"rows_between":2000,"halvings":0,"cell_chars":16384,"cell_head_chars":4096},"cells_cut":0,"cells_raw":0,"read":"whole","date_system":"1900"}

{"sheet":"General Information","index":0,"n_rows":41,"n_cols":3,"rows_kept":41,"cut":false,"hidden":false,"merged":[[19,1,19,2],[29,1,29,2],[31,1,31,2],[21,1,21,2],[40,1,40,2],[23,1,23,2],[25,1,25,2],[26,1,26,2],[27,1,27,2],[18,1,18,2],[1,1,1,2],[2,1,2,2],[14,1,14,2],[16,1,16,2],[17,1,17,2]]}
[]
[null,"TBP Laboratory Benchmarking Questionnaire - Clinical Biochemistry"]
[null,"General Information and Contact Details"]
[]
[null,"Organisation Name:","Please provide your organisation name"]
[null,"Department/Discipline:","Chemistry"]
[]
[null,"Details For Primary Contact Person For This Questionnaire:"]
[null,"Name:","Please provide the name of the primary contact person for this questionnaire"]
[null,"Job Title:","Please provide the job title of the primary contact person for this questionnaire"]
[null,"Email Address:","yourname@your-emailaddress.net"]
[null,"Telephone Number:","01234 567890"]
[]
[]
[null,"Introduction"]
[]
[null,"Benchmarking has become an essential component in modern strategy planning for NHS Pathology Laboratories across the UK, however the time and effort required to gather the required data has always proven to be a barrier for some.  For that reason, this latest version of the TBP Laboratory Benchmarking Questionnaire has been streamlined to strike the perfect balance between ease (and 'quickness') of completion vs gaining maximum value and bang-for-buck back from the data."]
[null,"The Benchmarking programme itself began at Keele University in 1994, and has progressed through many changes since it first launched.  During the past twelve months in particular, however, the service has taken giant strides forwards in terms of data collection processes and the technologies deployed to provide analyses and reporting, to the point that it is now almost unrecognisable.  Those returning to the service after a break of even a couple of years will likely be very surprised to see the advancements made across the board in all aspects of the way the process works, and the outputs which are delivered at the end."]
[null,"In terms of the questionnaires, we have reverted back to providing individual questionnaires for each disicpline (as opposed to the single multi-disciplinary questionnaire which was in use from 2015 to 2019).  There is also an additional 'General' questionnaire designed to collate the core data required to assist with peer grouping your laboratory and for reporting some of the 'shared' data, which helps prevent duplication of effort."]
[null,"This new streamlined questionnaire contains just three vastly shortened and simplified sections for completion:  Workload, Staffing & Finance, and Turnaround Times.  Each has been designed to be as quick and easy as possible to complete, with guidance notes and a variety of other 'assists' in place to help you through the process.  Of course, you are always welcome to contact us at any point for further help and assistance:"]
[null,"enquiries@thebenchmarkingpartnership.com"]
[null,"Once your questionnaire is complete, please return it to us at the email address above.  You will receive multiple opportunities to review your data via draft (full) reports, and to submit any changes/revisions as required, so please don't worry too much if you're unsure about any of the data you're submitting in your first submission  These things are often easier to spot in context vs your peer group, and in addition we will be providing more advanced data checking tools to assist you this time, so you will have plenty of scope to make amendments if anything looks wrong."]
[]
[null,"Before You Get Started"]
[]
[null,"We advise enabling macros in order to use the automatic jump-back to this page (see below), however don't worry - the questionnaire can be completed just fine without them."]
[null,"We also advise running this spreadsheet with calculations set to \"Automatic\" (found in the 'Formulas' tab under \"Calculation Options\" in most versions of Excel).  Again it's fine to run with calculations set to 'manual', however you will need to press F9 to process any changes you have made (particularly in order to review data via the Summary Data Sense Check Sheet)."]
[null,"Finally, we strongly recommend saving backup versions of this file as you go along (in addition to saving a 'clean' copy somewhere on your hard drive or network).  This way you can return to an earlier version without starting all over again in the event of an error occurring somewhere down the line)."]
[]
[null,"Navigation Menu"]
[]
[null,"To help you find your way around the questionnaire, you can click on the following links to guide you to the required section:"]
[]
[null,"Summary Data Sense Check Sheet","Summarises your data entered so far to provide a 'sense check' before submission"]
[null,"Workload Guidance Notes","Guidance notes to help you complete the workload data section"]
[null,"Workload Data Entry","Enter your workload data here - source of workload and individual test volume data"]
[null,"Staffing and Finance Guidance","Guidance notes to help you complete the staffing and finance data section"]
[null,"Staffing and Finance Data Entry","Enter your staffing and finance (non-pay) data here.  Pay data no longer required."]
[null,"Turnaround Times","Enter the turnaround times data for this discipline here"]
[]
[null,"You can return back to this page at any point by pressing CTRL+SHIFT+N simultaneously (provided you have macros enabled)"]

{"sheet":"Summary Data Sense Check Sheet","index":1,"n_rows":25,"n_cols":5,"rows_kept":25,"cut":false,"hidden":false,"merged":[[2,1,2,4],[1,1,1,4]]}
[]
[null,{"$f":"'General Information'!B2:C2","v":"TBP Laboratory Benchmarking Questionnaire - Clinical Biochemistry"}]
[null,"Summary Data - Sense Checking"]
[]
[null,"Workload Volume","Total Tests (Including Referred Out)","Tests Referred Out","Tests In-House (Calculated)"]
[null,"Total \"Traditional\" Chemistry Tests",{"$f":"SUM('Workload Data Entry'!C225,'Workload Data Entry'!C240,'Workload Data Entry'!C288,'Workload Data Entry'!C310,'Workload Data Entry'!C342,'Workload Data Entry'!C360,'Workload Data Entry'!C644)","v":0},{"$f":"SUM('Workload Data Entry'!D225,'Workload Data Entry'!D240,'Workload Data Entry'!D288,'Workload Data Entry'!D310,'Workload Data Entry'!D342,'Workload Data Entry'!D360,'Workload Data Entry'!D644)","v":0},{"$f":"SUM('Workload Data Entry'!E225,'Workload Data Entry'!E240,'Workload Data Entry'!E288,'Workload Data Entry'!E310,'Workload Data Entry'!E342,'Workload Data Entry'!E360,'Workload Data Entry'!E644)","v":0}]
[null,"Total \"Traditional\" Immunology Tests",{"$f":"SUM('Workload Data Entry'!C454,'Workload Data Entry'!C463,'Workload Data Entry'!C472,'Workload Data Entry'!C490,'Workload Data Entry'!C504,'Workload Data Entry'!C507,'Workload Data Entry'!C645)","v":0},{"$f":"SUM('Workload Data Entry'!D454,'Workload Data Entry'!D463,'Workload Data Entry'!D472,'Workload Data Entry'!D490,'Workload Data Entry'!D504,'Workload Data Entry'!D507,'Workload Data Entry'!D645)","v":0},{"$f":"SUM('Workload Data Entry'!E454,'Workload Data Entry'!E463,'Workload Data Entry'!E472,'Workload Data Entry'!E490,'Workload Data Entry'!E504,'Workload Data Entry'!E507,'Workload Data Entry'!E645)","v":0}]
[null,"Total \"Traditional\" Haematology and Blood Transfusion Tests",{"$f":"SUM('Workload Data Entry'!C523,'Workload Data Entry'!C533,'Workload Data Entry'!C557,'Workload Data Entry'!C563,'Workload Data Entry'!C579,'Workload Data Entry'!C593,'Workload Data Entry'!C599,'Workload Data Entry'!C605,'Workload Data Entry'!C616,'Workload Data Entry'!C622,'Workload Data Entry'!C641,'Workload Data Entry'!C646)","v":0},{"$f":"SUM('Workload Data Entry'!D523,'Workload Data Entry'!D533,'Workload Data Entry'!D557,'Workload Data Entry'!D563,'Workload Data Entry'!D579,'Workload Data Entry'!D593,'Workload Data Entry'!D599,'Workload Data Entry'!D605,'Workload Data Entry'!D616,'Workload Data Entry'!D622,'Workload Data Entry'!D641,'Workload Data Entry'!D646)","v":0},{"$f":"SUM('Workload Data Entry'!E523,'Workload Data Entry'!E533,'Workload Data Entry'!E557,'Workload Data Entry'!E563,'Workload Data Entry'!E579,'Workload Data Entry'!E593,'Workload Data Entry'!E599,'Workload Data Entry'!E605,'Workload Data Entry'!E616,'Workload Data Entry'!E622,'Workload Data Entry'!E641,'Workload Data Entry'!E646)","v":0}]
[null,"Total Any Other/Non-Defined Tests",{"$f":"SUM('Workload Data Entry'!C648)","v":0},{"$f":"SUM('Workload Data Entry'!D648)","v":0},{"$f":"SUM('Workload Data Entry'!E648)","v":0}]
[null,"Total Tests",{"$f":"SUM(C6:C9)","v":0},{"$f":"SUM(D6:D9)","v":0},0]
[]
[null,"Staffing Summary","FTE Staff","Salary"]
[null,"Medical Staff (Total)",{"$f":"SUM('Staffing and Finance Data Entry'!D30:D34)","v":0},{"$f":"'Staffing and Finance Data Entry'!D63","v":0}]
[null,"Clinical Scientists (Including Consultants and Trainees)",{"$f":"SUM('Staffing and Finance Data Entry'!D37:D40)","v":0},{"$f":"'Staffing and Finance Data Entry'!D64","v":0}]
[null,"Biomedical Scientists (Including Trainees)",{"$f":"SUM('Staffing and Finance Data Entry'!D43:D45)","v":0},{"$f":"'Staffing and Finance Data Entry'!D65","v":0}]
[null,"Laboratory Support Workers (MLA and Associate Practitioner)",{"$f":"SUM('Staffing and Finance Data Entry'!D46:D47)","v":0},{"$f":"'Staffing and Finance Data Entry'!D66","v":0}]
[null,"Administrative and Clerical Staff",{"$f":"SUM('Staffing and Finance Data Entry'!D51)","v":0},{"$f":"'Staffing and Finance Data Entry'!D67","v":0}]
[null,"Remaining Others (Including Additional Payments eg Out of Hours)",{"$f":"SUM(C19-SUM(C13:C17))","v":0},{"$f":"SUM(D19-SUM(D13:D17))","v":0}]
[null,"Total",{"$f":"'Staffing and Finance Data Entry'!D58","v":0},{"$f":"'Staffing and Finance Data Entry'!D60","v":0}]
[]
[null,"Non Pay and Total Expenditure"]
[null,"Total Non Pay",null,{"$f":"SUM('Staffing and Finance Data Entry'!D12)","v":0}]
[null,"Total Expenditure",null,{"$f":"SUM(D19,D22)","v":0}]
[]
[null,"Calculated Cost Per Test (Based on Tests In-House):",{"$f":"IF(ISERROR(IF(D19=0,\"\",IF(D22=0,\"\",SUM(D23/E10)))=TRUE),\"\",IF(D19=0,\"\",IF(D22=0,\"\",SUM(D23/E10))))","v":""}]

{"sheet":"Workload Guidance Notes","index":2,"n_rows":96,"n_cols":2,"rows_kept":96,"cut":false,"hidden":false,"merged":[[92,1,92,6],[36,1,36,6],[45,1,45,6],[53,1,53,6],[59,1,59,6],[69,1,69,6],[74,1,74,6],[79,1,79,6],[80,1,80,6],[83,1,83,6],[85,1,85,6],[90,1,90,6],[31,1,31,6],[1,1,1,6],[2,1,2,6],[4,1,4,6],[5,1,5,6],[8,1,8,6],[6,1,6,6],[13,1,13,6],[11,1,11,6],[23,1,23,6],[25,1,25,6],[28,1,28,6]]}
[]
[null,{"$f":"'General Information'!B2:C2","v":"TBP Laboratory Benchmarking Questionnaire - Clinical Biochemistry"}]
[null,"Workload Guidance Notes"]
[]
[null,"Individual tests data are once again being collected at individual disicpline level (ie separate questionnaire and workload matrix for each discipline).  We have provided a complete \"Blood Sciences\" test list for each individual discipline, even though many of these tests will not be performed in the department for which you are completing this questionnaire.  This is because different laboratories operate different multi-disciplinary ways of working, and we wish to allow for any potential combination of tests performed across each department."]
[null,"However, you should only account for tests performed in your department (ie the department to which this questionnaire relates), and should always include any staff and non-pay costs (within scope) included with performing that workload within this questionnaire.  Please do not worry about double-counting across multiple questionnaires at this stage; our data checking system will flag up to you where tests may have been double counted, and will work with you to ensure that any combined calculations of data in your final reports do not include double counting."]
[null,"Total tests values given should cover the total performed during the latest financial year (1st April 2019 to 31st March 2020)"]
[]
[null,"The use of requests and/or tests as unweighted units of workload measurement varies between departments.  Even the definitions of requests and tests vary between departments as well as within departments.  However, on-going development with significant input from our user groups and specialty panels have identified the most commonly used definitions of 'request' and 'test' and they are stated below.  Workload measurements will never be a flawless comparison across different departments, but these are the closest definitions available and will provide a useful and informative comparison of workload volume when analysed appropriately."]
[]
[null,"TBP Definition of a 'Test'"]
[null,"\"A result produced by an analytical process on a single specimen.  Calculated results and comments describing a test or result should NOT be counted as tests.\"  (Do not include analyser indices (e.g. haemolysis, icterus, lipaemia) in your test totals)."]
[]
[null,"Due to problems in many LIMS systems counting 'requests' in Blood Sciences disciplines, we no longer collect data for requests for Chemistry, Haematology, Immunology, or combined Blood Sciences."]
[]
[null,"Examples of Requests and Tests in Haematology"]
[]
[null,"Full blood count = one request and one test"]
[null,"Full blood count and ESR = one request and two tests"]
[null,"Full blood, ESR, INR, B12 and serum folate = one request and five tests"]
[]
[null,"N.B. 'Diff' should be included with the full blood count as one single test, NOT as a separate test."]
[]
[null,"PT, APTT, fibrinogen = one request and three tests.  (N.B. This applies whether tests are performed on either a semi-automated or a fully automated coagulometer)"]
[]
[null,"Platelet aggregation = 1 request and X number of tests, depending on how many aggregation studies are performed, e.g. ADP and ristocetin = 2 tests."]
[]
[null,"Blood Transfusion"]
[null,"In the 2001/2002 report, a detailed analysis was taken on definitions of blood transfusion requests and tests.  The majority of departments have now agreed the following definitions."]
[]
[null,"Blood Transfusion Request"]
[null,"A blood transfusion request should be patient focused and related to either (i) specimens taken from one patient at one time on which one or more tests are requested or (ii) a request for blood products/blood components irrespective of number or type of product/components requested at one time which may or may not necessitate a sample from a patient."]
[]
[null,"N.B. Blood product/component requests ONLY occur when issued separately from red cells."]
[]
[null,"Blood Transfusion Test"]
[null,"A test is (i) the output of either one analysis or a number of related analyses that produce a reportable conclusion e.g. blood group, antibody screen, or (ii) the workload associated with the issue of blood transfusion products and components measured as follows:"]
[null,"Platelets, fresh frozen plasma and cryo precipitate (measured in bags)"]
[null,"Albumin (measured by bottles irrespective of size and concentration)"]
[null,"Anti-D (measured by the number of vials irrespective of dose)"]
[null,"Coagulation concentrate (measured by the number of bottles irrespective of size, type and concentration)"]
[null,"Intravenous and tetanus immunoglobulin (measured by the number of bottles)"]
[null,"Autologus blood red cell units (measured by the number of units collected)"]
[null,"·"]
[null,"Blood Transfusion Sample"]
[null,"A blood transfusion sample is patient focused and is related to a specimen taken from one patient and received by the laboratory on which one or more tests are required which may or may not include the provision of blood products and blood components."]
[]
[null,"Examples of Blood Transfusion and Blood Product Workload"]
[]
[null,"Crossmatch of 4 units of red blood cells = 1 request, 3 tests (blood group, antibody screen, cross match) and 4 blood products/components."]
[]
[null,"Request for crossmatch of 4 units of red blood cells and 2 units of FFP = 1 request, 3 tests and 6 blood products/components."]
[]
[null,"Request for 1 unit of platelets and cross match of 4 units of red blood cells = 1 request and 3 tests and either 5 blood products/components (if platelets supplied in one pool), or 10 blood products/components if 6 individual bags of platelets supplied."]
[]
[null,"Request for 2 bottles of e.g. 4.5% albumin = 1 request and 2 blood products/components and no tests."]
[]
[null,"Blood Film with Report"]
[]
[null,"Blood film where a manual differential has been performed or an interpretative comment has been made in the report following examination of the film."]
[]
[null,"Blood Film without Report"]
[]
[null,"A blood film has been prepared as a result of internal laboratory working procedures and no report issued."]
[]
[]
[null,"Examples of tests in Immunology"]
[]
[null,"How to count results from multiplex ANA assays:"]
[null,"If you use an ANA screen that requires follow up additional tests such as DNA or ENA when the screen is positive (e.g. Phadia CTD/Symphony and ELISA ANA screens) then:"]
[null,"•    count the screen as one test under \"ANA screen/titre on other substrate\""]
[null,"•    count the individual follow on tests as additional tests under DNA or ENA as appropriate"]
[null,"•    if you characterise 6 ENA antigen (e.g. Ro, La, Sm, RNP, Jo-1, Scl-70) then count 6 tests for each sample tested for ENA"]
[]
[null,"If you use a multiplex method such as Luminex/Bioplex where the 'screen' simultaneously measures several antigens and follow on testing for DNA and ENA is not required because these are generated as part of the screen (e.g. Bioplex Luminex) then:"]
[null,"•    record the number of ANA tests as zero from this method (count any other ANA, e.g. By IIF, as normal)"]
[null,"•    record the number of DNAs performed as one for each sample processed"]
[null,"•    record the number of ENAs as the number of specificities multiplied by the number of samples processed"]
[null,"•    For example, for a test incorporating DNA and 12 'ENAs', record ANA = 0, DNA = 1, ENA = 12 tests for each sample"]
[null,"•    The above applies regardless of whether or not each individual specificity is reported, provided that a 'negative' report indicates that all of the specificities are negative"]
[null,"Where an autoantibody screen using a composite tissue block, e.g. stomach ± kidney ± liver is performed to screen for the presence of a combination of autoantibodies, e.g. ANA, Anti-GPC, ARA, ASMA and AMA, this should be reported as one test not the total number of specificities that may be identifiable."]
[]
[null,"Where an ANA titre is performed following a positive ANA screen this should be reported as one test, not two."]
[null,"ENA screen = 1 test, ENA characterisation = number of specificities tests for, e.g. if testing for Ro, La, Sm and RNP this equals 4 tests, or equals 6 tests if Scl-70 and Jo-1 are included."]
[null,"Each immunoglobulin specificity (IgG, IgA, IgM, IgD, IgE) is a test.  Similarly, complement C3 and C4 are each individual tests."]
[null,"Each antiphospholipid antibody specificity (e.g. cardiolipin, β2GPI or anti-phosphatidyl serine antibody) is a separate test.  If multiple isotypes (e.g. IgG and IgM isotypes for cardiolipin) are tested, each is one test."]
[]
[null,"ANCA ELISA MPO = 1, PR3 = 1, therefore if both are undertaken it is two tests."]
[]
[null,"Pneumococcal serotypes should be counted as separate tests.  This also applies to those included in total referred out tests."]
[null,"In calculating the number of allergy related tests each individual allergen specific Ab sought represents one test UNLESS part of a commercially provided MIX, e.g. Pharmacia Food Mix, in which case the count would be one test (not five for each of the allergens found in the mix).  Report multiple allergen strips or immunoblots as single assays on the appropriate line, not as individual specificities."]
[]
[null,"Lymphocyte phenotyping activity should be reported in terms of each of the panels identified, giving separately the panel specificity."]
[null,"Lymphocyte phenotyping/subsets for HIV"]
[null,"Lymphocyte phenotyping/subsets for PRIMARY immunodeficiency"]
[null,"Lymphocyte phenotyping/subsets for LYMPHOMA/LEUKAEMIA typing each constitute one panel."]

{"sheet":"Workload Data Entry","index":3,"n_rows":648,"n_cols":5,"rows_kept":648,"cut":false,"hidden":false,"merged":[[24,1,24,4],[18,1,18,4],[1,1,1,4],[19,1,19,4],[15,1,15,4],[3,1,3,4],[17,1,17,4]]}
[]
[null,{"$f":"'General Information'!B2:C2","v":"TBP Laboratory Benchmarking Questionnaire - Clinical Biochemistry"}]
[]
[null,"Source of Workload"]
[]
[null,"Source of Workload"]
[null,"Hospitals/laboratories within your overall Trust/Organisation",0]
[null,"Other NHS hospitals/laboratories within your network",0]
[null,"Other NHS hospitals/laboratories outside your network",0]
[null,"Private/non-NHS work",0]
[null,"Primary care/GP tests",0]
[null,"Any other not listed above",0]
[null,null,{"$f":"IF(SUM(C7:C12)<>1,\"Attention: Needs To Equal 100%\",\"\")","v":"Attention: Needs To Equal 100%"}]
[]
[]
[null,"Individual Tests:  Workload Volume"]
[]
[null,"Please provide data for total volume of each test performed during the most recent financial year (1st April 2019 to 31st March 2020).  First column (C) should include all tests done, including those referred out.  Second column (D) should contain the total volume of each test referred out (ie referred outside of your organisation, not sent to another laboratory site within your organisation).  The final column (E) is automatically calculated for you, and shows the total volume of each test performed in-house (for reference). "]
[null,"Due to the fact that departments operate in slightly different multi-disciplinary ways, we have provided a complete list of tests for all 'Blood Sciences' disicplines, starting with \"Traditional\" Clinical Biochemistry tests (Immunology and Haematology follow below) in order to ensure maximum flexibility.  However, you should ONLY include volume data for tests performed within the department that is covered by this questionnaire, and should always also include all staff and relevant non-pay associated with the performance of these tests in the Staffing and Finance section.  Please simply ignore all tests not relevant to the department you are filling this questionnaire in for."]
[null,"The colour coding and highlighting system will help you to quickly find the groups of tests you are looking for:"]
[]
[null,"Clinical Biochemistry","Blue"]
[null,"Immunology","Gold/Yellow"]
[null,"Haematology and Blood Transfusion","Red/Pink"]
[null,"Please refer to guidance notes section for further assistance, including guidance on how to count tests."]
[]
[null,"\"Traditional\" Clinical Biochemistry Tests","Total Tests (Including Referred Out)","Tests Referred Out","Tests In-House (Calculated)"]
[null,"Plasma/Serum/Blood"]
[null,"1,25 Hydroxy Vitamin D",0,0,{"$f":"IF(D29>C29,\"Error\",SUM(C29-D29))","v":0}]
[null,"11-Deoxycortisol",0,0,{"$f":"IF(D30>C30,\"Error\",SUM(C30-D30))","v":0}]
[null,"17 Hydroxy Progesterone",0,0,0]
[null,"25 Hydroxy Vitamin D",0,0,0]
[null,"ACTH",0,0,0]
[null,"Acyl Carnitine",0,0,0]
[null,"Adrenaline",0,0,0]
[null,"Albumin",0,0,0]
[null,"Alcohol (Ethanol)",0,0,0]
[null,"Aldosterone",0,0,0]
[null,"Alkaline phosphatase",0,0,0]
[null,"Alkaline phosphatase isoenzymes",0,0,0]
[null,"Alpha 1 Antitrypsin",0,0,0]
[null,"Alpha 1 Antitrypsin Phenotype",0,0,0]
[null,"Alpha-fetoprotein (non-Downs)",0,0,0]
[null,"ALT",0,0,0]
[null,"Aluminium",0,0,0]
[null,"Amino Acids",0,0,0]
[null,"Amiodarone",0,0,0]
[null,"Amitryptiline",0,0,0]
[null,"Ammonia",0,0,0]
[null,"Amylase",0,0,0]
[null,"Androstenedione",0,0,0]
[null,"Angiotensin Converting Enzyme",0,0,0]
[null,"Anti Mullerian hormone",0,0,0]
[null,"Anti thyroid peroxidase antibodies (TPO)",0,0,0]
[null,"Antibiotics (Gentamycin)",0,0,0]
[null,"Antibiotics (Other)",0,0,0]
[null,"Antibiotics (Tobramycin)",0,0,0]
[null,"Antibiotics (Vancomycin)",0,0,0]
[null,"Apo A1",0,0,0]
[null,"Apo B",0,0,0]
[null,"Apo E Genotype",0,0,0]
[null,"Arsenic",0,0,0]
[null,"Ascorbic acid (Leucocyte)",0,0,0]
[null,"AST",0,0,0]
[null,"B hydroxybutyrate",0,0,0]
[null,"B2 Microglobulin",0,0,0]
[null,"Bicarbonate",0,0,0]
[null,"Bile acids",0,0,0]
[null,"Bilirubin (Conjugated)",0,0,0]
[null,"Bilirubin (Total)",0,0,0]
[null,"Bismuth",0,0,0]
[null,"Blood Gas (count as 1 test, Exclude POCT)",0,0,0]
[null,"Blood Spot TSH",0,0,0]
[null,"BNP/NTproBNP",0,0,0]
[null,"Bone alkaline phosphatase",0,0,0]
[null,"CA 125",0,0,0]
[null,"CA 15-3",0,0,0]
[null,"CA 19-9",0,0,0]
[null,"Cadmium",0,0,0]
[null,"Caeruloplasmin",0,0,0]
[null,"Calcitonin",0,0,0]
[null,"Calcium",0,0,0]
[null,"Carbamazepine",0,0,0]
[null,"Carbohydrate Deficient transferrin",0,0,0]
[null,"Carboxyhaemoglobin",0,0,0]
[null,"Carotene",0,0,0]
[null,"Carotenoids (x1)",0,0,0]
[null,"CEA",0,0,0]
[null,"Chloride",0,0,0]
[null,"Cholesterol",0,0,0]
[null,"Cholinesterase",0,0,0]
[null,"Cholinesterase phenotype (count as 1 test)",0,0,0]
[null,"Chromium",0,0,0]
[null,"CK (Creatine Kinase)",0,0,{"$f":"IF(D94>C94,\"Error\",SUM(C94-D94))","v":0}]
[null,"CKMB Enzymatic",0,0,0]
[null,"CKMB Mass",0,0,0]
[null,"Cobalt",0,0,0]
[null,"Copper",0,0,0]
[null,"Cortisol",0,0,0]
[null,"C-Reactive Protein",0,0,0]
[null,"Creatinine Enzymatic",0,0,0]
[null,"Creatinine JAFFE",0,0,0]
[null,"CTx",0,0,0]
[null,"Cyclic AMP",0,0,0]
[null,"Cyclosporin",0,0,0]
[null,"Cystatin",0,0,0]
[null,"DHAS/DHEAS",0,0,0]
[null,"Digoxin",0,0,0]
[null,"Dihydrotestosterone",0,0,0]
[null,"Dopamine",0,0,0]
[null,"Downs Screening",0,0,0]
[null,"Ethosuximide",0,0,0]
[null,"Ethylene Glycol",0,0,0]
[null,"Ferritin",0,0,0]
[null,"Flecainide",0,0,0]
[null,"Folate",0,0,0]
[null,"Folate (Red Cell)",0,0,0]
[null,"Fructosamine",0,0,0]
[null,"FSH",0,0,0]
[null,"Gamma Glutamyl Transferase",0,0,0]
[null,"Gastrin",0,0,0]
[null,"Glucagon",0,0,0]
[null,"Glucose",0,0,0]
[null,"Growth Hormone",0,0,0]
[null,"Gut hormone screen",0,0,0]
[null,"Haptoglobin",0,0,0]
[null,"HbA1c",0,0,0]
[null,"HCG (Non-Downs)",0,0,0]
[null,"HDL",0,0,0]
[null,"HFE Genotype (Haemochromatosis)",0,0,0]
[null,"Homocysteine",0,0,0]
[null,"IGF1",0,0,0]
[null,"IGFBP-3",0,0,0]
[null,"Inhibin A/B",0,0,0]
[null,"Insulin",0,0,0]
[null,"Insulin C-Peptide",0,0,0]
[null,"Iron",0,0,0]
[null,"Iron Binding Capacity",0,0,0]
[null,"Lactate",0,0,0]
[null,"Lamotrigine",0,0,0]
[null,"LDH",0,0,0]
[null,"LDL (Direct)",0,0,0]
[null,"Lead",0,0,0]
[null,"Leptin",0,0,0]
[null,"LH",0,0,0]
[null,"Lipoprotein Lipase",0,0,0]
[null,"Lithium",0,0,0]
[null,"Lp(a)",0,0,0]
[null,"Macroprolactin",0,0,0]
[null,"Magnesium",0,0,0]
[null,"Manganese",0,0,0]
[null,"Mercury",0,0,0]
[null,"Methaemoglobin",0,0,0]
[null,"Methanol",0,0,0]
[null,"Methotrexate",0,0,0]
[null,"Myoglobin",0,0,0]
[null,"Neurone Specific Enolase",0,0,0]
[null,"Noradrenaline",0,0,{"$f":"IF(D158>C158,\"Error\",SUM(C158-D158))","v":0}]
[null,"Nortripyline",0,0,0]
[null,"Oestradiol",0,0,0]
[null,"Orosomucoid",0,0,0]
[null,"Osmolality",0,0,0]
[null,"Osteocalcein",0,0,0]
[null,"ELF Testing",0,0,0]
[null,"P111NP (Only those not already included in ELF testing)",0,0,0]
[null,"P1CP (bone markers)",0,0,0]
[null,"P1NP (bone markers)",0,0,0]
[null,"Pancreatic Polypeptide",0,0,0]
[null,"Paracetamol",0,0,0]
[null,"Phenobarbitone",0,0,0]
[null,"Phenytoin",0,0,0]
[null,"Phosphate",0,0,0]
[null,"PKU for Neonatal Screening",0,0,0]
[null,"Placental Alkaline Phosphatase",0,0,0]
[null,"Porphyrins",0,0,0]
[null,"Potassium",0,0,0]
[null,"Procalcitonin",0,0,0]
[null,"Progesterone",0,0,0]
[null,"Proinsulin",0,0,0]
[null,"Prolactin",0,0,0]
[null,"Protein S100",0,0,0]
[null,"PSA (Free)",0,0,0]
[null,"PSA (Total)",0,0,0]
[null,"PTH",0,0,0]
[null,"PTHrP",0,0,0]
[null,"Pyruvate",0,0,0]
[null,"Quantitative thyroid hormone binding",0,0,0]
[null,"Renin Activity",0,0,0]
[null,"Salicylate",0,0,0]
[null,"Selenium",0,0,0]
[null,"SHBG",0,0,0]
[null,"Sirolimus",0,0,0]
[null,"Sodium",0,0,0]
[null,"Somatostatin",0,0,0]
[null,"Sulphonylureas",0,0,0]
[null,"T3 (free)",0,0,0]
[null,"T3 (Total)",0,0,0]
[null,"T4 (Free)",0,0,0]
[null,"T4 (Total)",0,0,0]
[null,"Tacrolimus (FK 506)",0,0,0]
[null,"Testosterone",0,0,0]
[null,"Theophyline",0,0,0]
[null,"Thiamine Diphosphate",0,0,0]
[null,"Thyroglobulin",0,0,0]
[null,"Thyroid Binding Globulin",0,0,0]
[null,"Total Protein",0,0,0]
[null,"TPMT",0,0,0]
[null,"Transferrin",0,0,0]
[null,"Transketolase",0,0,0]
[null,"Triglyceride",0,0,0]
[null,"Troponin I",0,0,0]
[null,"Troponin T",0,0,0]
[null,"TSH (Routine)",0,0,0]
[null,"TSH Receptor AB",0,0,0]
[null,"Urea",0,0,0]
[null,"Uric Acid",0,0,0]
[null,"Valproate",0,0,0]
[null,"Vasoactive Intestinal Polypeptide",0,0,0]
[null,"Vitamin A",0,0,0]
[null,"Vitamin B6",0,0,0]
[null,"Vitamin C",0,0,0]
[null,"Vitamin E",0,0,{"$f":"IF(D222>C222,\"Error\",SUM(C222-D222))","v":0}]
[null,"White cell enzymes",0,0,0]
[null,"Zinc",0,0,0]
[null,"Total Plasma/Serum/Blood Tests",{"$f":"SUM(C29:C224)","v":0},{"$f":"SUM(D29:D224)","v":0},0]
[]
[null,"Urine Drugs of Abuse"]
[null,"Amphetamine",0,0,0]
[null,"Barbiturates",0,0,0]
[null,"Benzodiazepine",0,0,0]
[null,"Buprenorphine",0,0,0]
[null,"Cannabis",0,0,0]
[null,"Cocaine",0,0,0]
[null,"GC/MS Confirmation",0,0,0]
[null,"LSD",0,0,0]
[null,"Methadone",0,0,0]
[null,"Opiates",0,0,0]
[null,"Rapid Slide test (e.g. Triage, InstAlert etc)",0,0,0]
[null,"TLC confirmation",0,0,0]
[null,"Total Urine Drugs of Abuse",{"$f":"SUM(C228:C239)","v":0},{"$f":"SUM(D228:D239)","v":0},0]
[]
[null,"Other Urine Tests"]
[null,"Urine 5 Hydroxy Indole Acetic Acid",0,0,0]
[null,"Urine Albumin/Microalbumin",0,0,0]
[null,"Urine Alcohol",0,0,0]
[null,"Urine Amino acid profiles (x1)",0,0,0]
[null,"Urine Amylase",0,0,0]
[null,"Urine B2 Microglobulin",0,0,0]
[null,"Urine Bilirbubin",0,0,0]
[null,"Urine Calcium",0,0,0]
[null,"Urine Catecholamines (including metadrenaline), HPLC (count as 1 test)",0,0,0]
[null,"Urine Chloride",0,0,0]
[null,"Urine Copper",0,0,0]
[null,"Urine Cortisol (UFC)",0,0,0]
[null,"Urine Cotinine",0,0,0]
[null,"Urine Creatinine",0,0,0]
[null,"Urine Cystine",0,0,0]
[null,"Urine DPD",0,0,0]
[null,"Urine Glucose",0,0,0]
[null,"Urine Iron",0,0,0]
[null,"Urine Laxative screen",0,0,0]
[null,"Urine Light Chains",0,0,0]
[null,"Urine Magnesium",0,0,0]
[null,"Urine Mercury",0,0,0]
[null,"Urine Mucopolysaccharides",0,0,0]
[null,"Urine Myoglobin",0,0,0]
[null,"Urine NAG",0,0,0]
[null,"Urine Nitrogen",0,0,0]
[null,"Urine Normetadrenaline",0,0,0]
[null,"Urine Organic acids",0,0,0]
[null,"Urine Osmolality",0,0,0]
[null,"Urine Oxalate",0,0,0]
[null,"Urine Paraquat",0,0,0]
[null,"Urine Phosphate",0,0,0]
[null,"Urine Porphobilinogen",0,0,0]
[null,"Urine Porphyrins",0,0,0]
[null,"Urine Potassium",0,0,0]
[null,"Urine Pregnancy Test (not by quantitation of HCG)",0,0,0]
[null,"Urine Protein (24hr)",0,0,0]
[null,"Urine Protein (reported as creatinine ratio)",0,0,0]
[null,"Urine Reducing substances",0,0,0]
[null,"Urine Sodium",0,0,0]
[null,"Urine Steroid Profile (x1)",0,0,0]
[null,"Urine Urate",0,0,0]
[null,"Urine Urea",0,0,0]
[null,"Urine volume",0,0,0]
[null,"Urine Urobilinogen",0,0,0]
[null,"Total Other Urine Tests",{"$f":"SUM(C243:C287)","v":0},{"$f":"SUM(D243:D287)","v":0},0]
[]
[null,"Fluids Tests"]
[null,"Fluid Albumin",0,0,0]
[null,"Fluid Alpha-fetoprotein",0,0,{"$f":"IF(D292>C292,\"Error\",SUM(C292-D292))","v":0}]
[null,"Fluid Amylase",0,0,0]
[null,"Fluid Creatinine",0,0,0]
[null,"Fluid CSF Glucose",0,0,0]
[null,"Fluid CSF IgG",0,0,0]
[null,"Fluid CSF Protein",0,0,0]
[null,"Fluid Glucose",0,0,0]
[null,"Fluid HCG",0,0,0]
[null,"Fluid Lactate Dehydrogenase",0,0,0]
[null,"Fluid pH",0,0,0]
[null,"Fluid Potassium",0,0,0]
[null,"Fluid Protein",0,0,0]
[null,"Fluid Sodium",0,0,0]
[null,"Fluid Sweat Tests",0,0,0]
[null,"Fluid Tau protein",0,0,0]
[null,"Fluid Urate",0,0,0]
[null,"Fluid Urea",0,0,0]
[null,"Fluid Xanthochromia (spectrophotometric)",0,0,0]
[null,"Total Fluids Tests",{"$f":"SUM(C291:C309)","v":0},{"$f":"SUM(D291:D309)","v":0},0]
[]
[null,"Immunochemistry"]
[null,"C1 Inhibitor antigenic assay",0,0,0]
[null,"C1 Inhibitor autoantibodies ",0,0,0]
[null,"C1 Inhibitor functional assay",0,0,0]
[null,"C1q autoantibody",0,0,0]
[null,"C3 quantitation",0,0,0]
[null,"C3d evaluations",0,0,0]
[null,"C4 quantitation",0,0,0]
[null,"CH50 or 100/AltCH50 or 100 ",0,0,0]
[null,"Complement activation e.g. for C3a C5a etc.",0,0,0]
[null,"Complement component e.g. C2, C8 etc",0,0,0]
[null,"Cryofibrinogen studies",0,0,0]
[null,"Cryoglobulin screen",0,0,0]
[null,"Cryoglobulin typing",0,0,0]
[null,"CSF Oligoclonal Bands",0,0,0]
[null,"Cytokine Levels",0,0,0]
[null,"IgA",0,0,0]
[null,"IgD",0,0,0]
[null,"IgG",0,0,0]
[null,"IgG subclasses (G1, 2, 3 and 4)",0,0,0]
[null,"IgM",0,0,0]
[null,"Mannose binding lectin",0,0,0]
[null,"Protein electrophoresis",0,0,0]
[null,"Serum free light chains",0,0,0]
[null,"Serum paraprotein quantitation",0,0,0]
[null,"Serum paraprotein immunotyping",0,0,0]
[null,"Serum paraprotein immunofixation",0,0,0]
[null,"Urine electrophoresis",0,0,0]
[null,"Urine immunofixation",0,0,0]
[null,"VEGF",0,0,0]
[null,"Total Immunochemistry Tests",{"$f":"SUM(C313:C341)","v":0},{"$f":"SUM(D313:D341)","v":0},0]
[]
[null,"Other Chemistry Tests"]
[null,"Bloodspot 17-OHProgesterone",0,0,0]
[null,"Faecal Calprotectin",0,0,0]
[null,"Faecal chromatography",0,0,0]
[null,"Faecal Elastase",0,0,0]
[null,"Faecal Fat",0,0,0]
[null,"Faecal Immunochemical Tests (FIT)",0,0,0]
[null,"Faecal Occult Blood (non-immuno)",0,0,0]
[null,"Faecal Ph",0,0,0]
[null,"Faecal reducing substances",0,0,0]
[null,"Faecal Total Porphyrins",0,0,0]
[null,"Faecal Weight",0,0,0]
[null,"Immuno-reactive trypsin",0,0,0]
[null,"Liver Iron",0,0,0]
[null,"Renal Calculus",0,0,0]
[null,"Urea Breath Test",0,0,0]
[null,"Total Other Chemistry Tests",{"$f":"SUM(C345:C359)","v":0},{"$f":"SUM(D345:D359)","v":0},0]
[]
[null,"\"Traditional\" Immunology Tests","Total Tests (Including Referred Out)","Tests Referred Out","Tests In-House (Calculated)"]
[null,"Autoimmune Serology"]
[null,"68kD inner ear protein antibodies",0,0,{"$f":"IF(D364>C364,\"Error\",SUM(C364-D364))","v":0}]
[null,"Acetyl choline receptor antibodies",0,0,0]
[null,"Adrenal antibodies",0,0,0]
[null,"AMPA 1 & 2 antibodies",0,0,0]
[null,"ANA screen on Hep2/Hep2000",0,0,0]
[null,"ANA screen on other substrate",0,0,0]
[null,"ANA titre on Hep2/Hep2000/other substrate (one test per sample NOT each dilution)",0,0,0]
[null,"ANCA  - immunoassay for PR3 antibodies = 1 test",0,0,0]
[null,"ANCA - immunoassay for MPO antbodies = 1 test",0,0,0]
[null,"ANCA by indirect immunofluorescence = 1 test",0,0,0]
[null,"Aquaporin 4 antibodies",0,0,0]
[null,"Basal ganglia antibodies",0,0,0]
[null,"Beta-2 glycoprotein 1 antibodies (IgG)",0,0,0]
[null,"Beta-2 glycoprotein 1 antibodies (IgM)",0,0,0]
[null,"Biological antibodies (e.g. infliximab antibodies)",0,0,0]
[null,"Biological levels (e.g. infliximab levels)",0,0,0]
[null,"C1q antibodies",0,0,0]
[null,"C3 nephritic factor",0,0,0]
[null,"Cardiac muscle antibodies",0,0,0]
[null,"Cardiolipin antibodies (IgG)",0,0,0]
[null,"Cardiolipin antibodies (IgM)",0,0,0]
[null,"CASPR2 antibodies",0,0,0]
[null,"Centromere B (CENPB) antibodies - by immunoassay/blot not IIF",0,0,0]
[null,"Connective tissue disease (CTD) screen (one test per sample)",0,0,0]
[null,"Cyclic citrullinated proteins (CCP) antibodies",0,0,0]
[null,"Deamidated-gliadin antibodies",0,0,0]
[null,"DNA antibodies by immunoassay/ELISA",0,0,0]
[null,"DNA antibodies by indirect immunofluoresence (Crithidia)",0,0,0]
[null,"ENA screen (1 test per sample)",0,0,0]
[null,"Endomysial (IgA) antibodies",0,0,0]
[null,"Endomysial (IgG) antibodies",0,0,0]
[null,"Fibrallin antibodies",0,0,0]
[null,"GABA antibodies",0,0,0]
[null,"Ganglionic acetyl receptor antibodies",0,0,0]
[null,"Glomerular basement membrane (GBM) antibodies",0,0,0]
[null,"Glutamic acid decarboxylase (GAD) antibodies",0,0,0]
[null,"Glycine receptor antibodies",0,0,0]
[null,"Ganglioside antibodies",0,0,0]
[null,"Myelin associated glycoprotein (MAG) antibodies",0,0,0]
[null,"Beta interferon neutralising antibodies",0,0,0]
[null,"Granulocyte antibodies",0,0,0]
[null,"Histone antibodies",0,0,0]
[null,"HMCoA antibodies",0,0,0]
[null,"IA-2 antibodies",0,0,0]
[null,"ZnT8 antibodies",0,0,0]
[null,"Insulin antibodies",0,0,0]
[null,"Intrinsic factor antibodies",0,0,0]
[null,"Islet cell antibodies",0,0,0]
[null,"Jo-1 antibodies",0,0,0]
[null,"La antibodies",0,0,0]
[null,"LGIR1 antibodies",0,0,0]
[null,"Lig1 antibodies",0,0,0]
[null,"Liver & gastric parietal cell antibodies by indirect immunofluorescence",0,0,0]
[null,"Liver antibodies by immunoblot (1 test per sample)",0,0,0]
[null,"Liver antibody titrations (one test per sample NOT each dilution)",0,0,0]
[null,"Mi-2 antibodies",0,0,0]
[null,"MOGL antibodies",0,0,0]
[null,"Muscle specific kinase (MUSK) antibodies",0,0,0]
[null,"Myositis antibody panel by immunoblot (1 test per sample)",0,0,0]
[null,"Neuronal antibodies by indirect immunofluorescence",0,0,0]
[null,"Neuronal antibodies by immunoblot (1 test per sample)",0,0,0]
[null,"NMDA receptor antibodies",0,0,0]
[null,"Other anti-phospholipid antibodies",0,0,0]
[null,"Other autoantibodies by indirect fluorescence",0,0,{"$f":"IF(D427>C427,\"Error\",SUM(C427-D427))","v":0}]
[null,"Parathyroid antibodies",0,0,0]
[null,"PCNA antibodies",0,0,0]
[null,"Phospholipase A2 (PLA2) receptor antibodies",0,0,0]
[null,"Pyruvate dehydrogenase (M2) antibodies",0,0,0]
[null,"Rheumatoid factor by latex agglutination",0,0,0]
[null,"Rheumatoid factor by quantitative assay",0,0,0]
[null,"Rheumatoid factor - follow up test",0,0,0]
[null,"Ribosomal P antibodies",0,0,0]
[null,"RNA polymerase III antibodies",0,0,0]
[null,"Ro52 antibodies",0,0,0]
[null,"Ro60 antibodies",0,0,0]
[null,"Scl70 antibodies",0,0,0]
[null,"Skeletal muscle antibodies",0,0,0]
[null,"Skin abs (ELISA e.g. DSG1/3, BP180/230)",0,0,0]
[null,"Skin antibodies (e.g. Pemphigus/goid) by indirect immunofluorescence",0,0,0]
[null,"Sm antibodies",0,0,0]
[null,"Steroid cell antibodies (Ovary/testes/adrenal antibodies)",0,0,0]
[null,"Submaxillary gland antibodies",0,0,0]
[null,"Thyroglobulin antibodies",0,0,0]
[null,"Thyroid peroxidase antobodies",0,0,0]
[null,"Tissue transglutaminase antibodies (IgA)",0,0,0]
[null,"Tissue transglutaminase antibodies (IgG)",0,0,0]
[null,"TSH receptor antibodies   ",0,0,0]
[null,"U1 RNP / 70kDa RNP antibodies",0,0,0]
[null,"Voltage gated calcium channel (VGCC) antibodies",0,0,0]
[null,"Voltage gated potassium channel (VGKC) antibodies",0,0,0]
[null,"Total Autoimmune Serology",{"$f":"SUM(C364:C453)","v":0},{"$f":"SUM(D364:D453)","v":0},0]
[]
[null,"Allergy Tests"]
[null,"Allergen Components Specific IgE",0,0,0]
[null,"Allergen Specific IgE",0,0,0]
[null,"IgE Total level",0,0,0]
[null,"IgG precipitins (Aspergillus, Avian etc…)",0,0,0]
[null,"ISAC Test",0,0,0]
[null,"Tryptase",0,0,0]
[null,"Total Allergy Tests",{"$f":"SUM(C457:C462)","v":0},{"$f":"SUM(D457:D462)","v":0},0]
[]
[null,"Microbial Serology for Immunocompetence Testing"]
[null,"Meningococcal antibody (MCA)",0,0,0]
[null,"Diphtheria antibody",0,0,0]
[null,"Haemophilus influenzae b antibody",0,0,0]
[null,"Pneumococcal antibody",0,0,0]
[null,"Pneumococcal serotype specific antibody response (PSSA)",0,0,0]
[null,"Tetanus antibody",0,0,0]
[null,"Total Microbial Serology for Immunocompetence Testing",{"$f":"SUM(C466:C471)","v":0},{"$f":"SUM(D466:D471)","v":0},0]
[]
[null,"Cellular Immunology"]
[null,"B-cell phenotyping for common variable immunodeficiency (IgD/CD27)",0,0,0]
[null,"Cytokine functional studies",0,0,0]
[null,"Gamma interferon assays for TB: in-house assay",0,0,0]
[null,"Gamma interferon assays for TB: quantiferon",0,0,0]
[null,"Gamma interferon assays for TB: T-spot",0,0,0]
[null,"Lymphocyte function assays",0,0,0]
[null,"Specialised functional assays for primary immune deficiency (excluding genetics)",0,0,0]
[null,"Lymphocyte phenotyping/subset for PRIMARY immunodeficiency",0,0,0]
[null,"Lymphocyte phenotyping/subsets for HIV",0,0,0]
[null,"Lymphocyte phenotyping/subsets LEUKAEMIA/LYMPHOMA typing ",0,0,0]
[null,"Natural killer cell assay",0,0,0]
[null,"Neutrophil Adhesion Markers",0,0,0]
[null,"Neutrophil function",0,0,0]
[null,"Neutrophil respiratory burst by flow cytometry",0,0,0]
[null,"Neutrophil respiratory burst by NBT slide assay",0,0,0]
[null,"Total Cellular Immunology",{"$f":"SUM(C475:C489)","v":0},{"$f":"SUM(D475:D489)","v":0},0]
[]
[null,"Histocompatibility and Immunogenetics Tests"]
[null,"Crossmatching",0,0,0]
[null,"HFE typing",0,0,0]
[null,"HLA antibody characterisation",0,0,0]
[null,"HLA B27 typing flow cytometry",0,0,0]
[null,"HLA B57 ",0,0,0]
[null,"HLA Other Disease Association Allele Typing",0,0,0]
[null,"HLA class I A & B",0,0,{"$f":"IF(D499>C499,\"Error\",SUM(C499-D499))","v":0}]
[null,"HLA class I Cw",0,0,0]
[null,"HLA class II DP",0,0,0]
[null,"HLA class II DQ",0,0,0]
[null,"HLA class II DR",0,0,0]
[null,"Total H&I Tests",{"$f":"SUM(C493:C503)","v":0},{"$f":"SUM(D493:D503)","v":0},0]
[]
[null,"Immunohistology Tests"]
[null,"Total Immunohistology Tests",0,0,0]
[]
[null,"\"Traditional\" Haematology and Blood Transfusion Tests","Total Tests (Including Referred Out)","Tests Referred Out","Tests In-House (Calculated)"]
[null,"Routine Haematology"]
[null,"Blood film - no report(1)",0,0,0]
[null,"Blood film - with report(1)",0,0,0]
[null,"ESR",0,0,0]
[null,"Full Blood Count (FBC)",0,0,0]
[null,"Glandular fever screening",0,0,0]
[null,"Malaria parasite film",0,0,0]
[null,"Other Malaria Tests",0,0,0]
[null,"Plasma viscosity",0,0,0]
[null,"Pregnancy test",0,0,0]
[null,"Reticulocytes",0,0,0]
[null,"Semen Analysis: fertility",0,0,0]
[null,"Semen Analysis: post vasectomy",0,0,0]
[null,"Total Routine Haematology",{"$f":"SUM(C511:C522)","v":0},{"$f":"SUM(D511:D522)","v":0},0]
[]
[null,"Bone Marrow Investigations"]
[null,"Aspirate",0,0,0]
[null,"Cytogenetics, eg Not Molecular Diagnostics",0,0,0]
[null,"Immunocytochemistry",0,0,0]
[null,"Iron stains",0,0,0]
[null,"Other cytochemistry",0,0,0]
[null,"Total Bone Marrow Investigations",0,0,0]
[null,"Trephine biopsy",0,0,0]
[null,"Total Bone Marrow Investigations",{"$f":"SUM(C526:C532)","v":0},{"$f":"SUM(D526:D532)","v":0},0]
[]
[null,"Coagulation"]
[null,"APC resistance",0,0,0]
[null,"APTT",0,0,0]
[null,"AT (Anti Thrombin)",0,0,0]
[null,"Factor assay",0,0,0]
[null,"Factor Xa",0,0,0]
[null,"FDP/D Dimer",0,0,0]
[null,"Fibrinogen: Clauss etc",0,0,0]
[null,"Fibrinogen: derived",0,0,0]
[null,"FV Leiden/Prothrombin G20210A",0,0,0]
[null,"Inhibitor assay",0,0,0]
[null,"Inhibitor screens (not lupus)",0,0,0]
[null,"INR",0,0,0]
[null,"Lupus Anticoagulant",0,0,0]
[null,"NOAC Management",0,0,0]
[null,"Platelet aggregation tests",0,0,0]
[null,"Protein C",0,0,0]
[null,"Protein S",0,0,0]
[null,"PT",0,0,0]
[null,"Reptilase time",0,0,0]
[null,"Thrombin time",0,0,0]
[null,"VWF multimer analysis",0,0,0]
[null,"Section Subtotal - Coagulation",{"$f":"SUM(C536:C556)","v":0},{"$f":"SUM(D536:D556)","v":0},0]
[]
[null,"Haematinic Assays"]
[null,"Erythropoietin",0,0,0]
[null,"Vitamin B12 (active)",0,0,0]
[null,"Vitamin B12 (standard)",0,0,0]
[null,"Total Haematinic Assays",{"$f":"SUM(C560:C562)","v":0},{"$f":"SUM(D560:D562)","v":0},0]
[]
[null,"Blood Products and Blood Components"]
[null,"Albumin",0,0,0]
[null,"Anti-D",0,0,0]
[null,"Beriplex",0,0,0]
[null,"Coagulation concentrate",0,0,0]
[null,"Fibrinogen concentrate",0,0,0]
[null,"Cryoprecipitate",0,0,0]
[null,"Fresh frozen plasma",0,0,0]
[null,"Intravenous immunoglobulin",0,0,0]
[null,"No. of red blood cell units received from the blood transfusion service",0,0,0]
[null,"NovoSeven",0,0,0]
[null,"Platelets",0,0,{"$f":"IF(D576>C576,\"Error\",SUM(C576-D576))","v":0}]
[null,"Tetanus immunoglobulin",0,0,0]
[null,"Viral Inactivated FFP",0,0,0]
[null,"Total Blood Products and Blood Components",{"$f":"SUM(C566:C578)","v":0},{"$f":"SUM(D566:D578)","v":0},0]
[]
[null,"Blood Bank"]
[null,"Antenatal antibody screen",0,0,0]
[null,"Antibody identification - all other",0,0,0]
[null,"Antibody identification due to prophylactic Anti-D",0,0,0]
[null,"Antibody screen",0,0,0]
[null,"Blood group (see guidance notes)",0,0,0]
[null,"DCT",0,0,0]
[null,"Electronic crossmatch",0,0,0]
[null,"Estimation of large FMH",0,0,0]
[null,"Histocompatibility and Immunogenetics tests",0,0,0]
[null,"Kleihauer",0,0,0]
[null,"Traditional crossmatch",0,0,0]
[null,"Total Blood Bank",{"$f":"SUM(C582:C592)","v":0},{"$f":"SUM(D582:D592)","v":0},0]
[]
[null,"Bone Marrow/Stem Cell Procedures"]
[null,"Bone marrow/stem cell manipulations",0,0,0]
[null,"Bone marrow/stem cell storage in your department",0,0,0]
[null,"Cell culture",0,0,0]
[null,"Total Bone Marrow/Stem Cell Procedures",{"$f":"SUM(C596:C598)","v":0},{"$f":"SUM(D596:D598)","v":0},0]
[]
[null,"Flow Cytometry"]
[null,"CD34",0,0,0]
[null,"MRD (Minimal Residual Disease)",0,0,0]
[null,"Platelets",0,0,0]
[null,"Section Subtotal - Flow Cytometry",{"$f":"SUM(C602:C604)","v":0},{"$f":"SUM(D602:D604)","v":0},{"$f":"SUM(E602:E604)","v":0}]
[]
[null,"Haemolytic Anaemia"]
[null,"G6PD",0,0,0]
[null,"Haemoglobin A2",0,0,0]
[null,"Haemoglobin electrophoresis",0,0,0]
[null,"HbF",0,0,0]
[null,"HPLC",0,0,0]
[null,"Pyruvate kinase",0,0,0]
[null,"Screening for HS",0,0,0]
[null,"Sickle cell screening test",0,0,0]
[null,"Total Haemolytic Anaemia",{"$f":"SUM(C608:C615)","v":0},{"$f":"SUM(D608:D615)","v":0},0]
[]
[null,"Radioisotopes"]
[null,"Plasma volume",0,0,0]
[null,"Red cell mass",0,0,0]
[null,"Schilling test",0,0,0]
[null,"Total Radioisotopes",{"$f":"SUM(C619:C621)","v":0},{"$f":"SUM(D619:D621)","v":0},{"$f":"SUM(E619:E621)","v":0}]
[]
[null,"Molecular Tests"]
[null,"JAK - 2 mutations",0,0,0]
[null,"PCR - bcr/abl monitoring",0,0,0]
[null,"CALR",0,0,0]
[null,"MPL",0,0,0]
[null,"ASXL1",0,0,0]
[null,"MYD88",0,0,0]
[null,"Other Molecular Test 1",0,0,0]
[null,"Other Molecular Test 2",0,0,0]
[null,"Other Molecular Test 3",0,0,0]
[null,"Other Molecular Test 4",0,0,0]
[null,"Other Molecular Test 5",0,0,0]
[null,"Other Molecular Test 6",0,0,0]
[null,"Other Molecular Test 7",0,0,0]
[null,"Other Molecular Test 8",0,0,0]
[null,"Other Molecular Test 9",0,0,0]
[null,"Other Molecular Test 10",0,0,0]
[null,"Total Molecular Tests",{"$f":"SUM(C625:C640)","v":0},{"$f":"SUM(D625:D640)","v":0},0]
[]
[null,"Remaining Other Tests","Total Tests (Including Referred Out)","Tests Referred Out","Tests In-House (Calculated)"]
[null,"\"Traditional\" Chemistry",0,0,0]
[null,"\"Traditional\" Immunology",0,0,{"$f":"IF(D645>C645,\"Error\",SUM(C645-D645))","v":0}]
[null,"\"Traditional\" Haematology and Blood Transfusion",0,0,0]
[null,"\"Traditional\" Immunology",{"$f":"C645","v":0},{"$f":"D645","v":0},0]
[null,"Any Others/Non-Defined",0,0,0]

{"sheet":"Staffing and Finance Guidance","index":4,"n_rows":101,"n_cols":9,"rows_kept":101,"cut":false,"hidden":false,"merged":[[100,8,107,14],[81,8,81,14],[84,1,84,14],[86,1,86,14],[88,1,88,14],[91,8,98,14],[99,8,99,14],[77,8,80,14],[42,8,42,14],[44,1,44,14],[46,1,46,14],[48,1,48,14],[50,8,53,14],[55,1,55,14],[58,8,59,14],[60,8,60,14],[61,8,62,14],[63,8,67,14],[68,8,76,14],[26,8,29,14],[32,1,32,14],[35,1,35,14],[37,1,37,14],[39,8,41,14],[21,8,24,14],[2,1,2,14],[1,1,1,14],[4,1,4,14],[6,8,9,14],[11,8,13,14],[14,8,14,14],[16,8,19,14]]}
[]
[null,{"$f":"'General Information'!B2:C2","v":"TBP Laboratory Benchmarking Questionnaire - Clinical Biochemistry"}]
[null,"Inputting Your Staffing and Non-Pay Data"]
[]
[null,"Finance Data Configuration"]
[]
[null,null,null,null,null,null,null,null,"You will begin by configuring the 'Finance' options, which will apply modifiers to your salaries and also allow you to enter your non-pay value.  \"On Costs\" are set to 26% by default, which is a standard contribution made towards things such as pensions and payroll tax."]
[]
[]
[]
[]
[null,null,null,null,null,null,null,null,"\"High Cost Area Supplement\", formerly referred to as 'London Weighting', applies an additional percentage to salaries for organisations based in qualifying geographical areas."]
[]
[]
[null,null,null,null,null,null,null,null,"Click here for further information on HCAS."]
[]
[null,null,null,null,null,null,null,null,"The database for this report includes 'Actual' salaries submitted by departments in your peer group.  However, you can instead choose to apply your settings (including HCAS, on-costs, and average experience for each role, etc) to their data to enable normalised comparability."]
[]
[]
[]
[]
[null,null,null,null,null,null,null,null,"\"Additional Staff Payments\" will include items such as Out Of Hours payments, but can also include anything you may additionally pay staff over and above anything already defined in this setup to ensure you calculated salaries figure is 100% correct."]
[]
[]
[]
[]
[null,null,null,null,null,null,null,null,"Our definition for counting 'Non Pay' has been long-established through the National Pathology Benchmarking Programme, and it is important to follow the definition in order to ensure your data are comparable with those of your peer group."]
[]
[]
[]
[]
[null,"Calculating Non-Pay"]
[null,"Non-pay expenditure should include items such as:  Minor capital purchases (£5,000 or below), leasehold payments, reagents costs, maintenance payments and managed service contract costs, depreciation cost estimates for owned equipment, consumables, travel, course and conference fees, etc.  Do NOT include blood costs, even if they are on your budget (because some laboratories are nationally funded by the NBTS, or simply do not count blood costs in their budget).  You should also NOT include capital charge, transport costs, phlebotomy costs or hospital overhead charges."]
[]
[]
[null,"Medical Staff Salary Configuration"]
[]
[null,"A range of options derived from national pay guidelines have been provided to help generate accurate salary information for each group of your Medical Staff.  The options require you to pick a 'typical' profile which will be most representative of your Medical Staff as a whole, however we appreciate that some departments might struggle to find a suitable profile that will 100% match that of their staff.  Under these circumstances you should select the options which generate the closest result in terms of salary, and then use the \"Additional Medical Staff Cost Modifier\" percentage to make a manual adjustment."]
[]
[null,null,null,null,null,null,null,null,"The options provided in the 'Report Setup' page reflect national pay structures for Medical Staff. "]
[]
[]
[null,null,null,null,null,null,null,null,"Further guidance can be found here."]
[]
[null,"Please note that there is a section at the bottom of the workforce data entry matrix which will show you the calculated salaries for each core group based on your current options selected and FTE data entered.  This is provided for guidance to help you double check the calculated salaries for each selected staff group."]
[]
[null,"Trainee Contribution Weighting"]
[]
[null,"Whilst trainees make a significant contribution to the overal productivity and efficiency of the laboratory, their overall contribution is not as significant as a fully qualified member of staff.  Over the past 20 years our national benchmarking data have attempted to reflect this through \"Weighting\" percentages for the contribution made to overall output by each key group of trainees (Junior Doctors/SpR, Clinical Scientists, and Biomedical Scientists).  This report provides you with the flexibility to adjust the contribution of each group to a figure representative of your organisation.  By default the system is set to 36.5% for Junior Doctors/SpR, a figure which was previously recognised nationally, albeit now redundant (we believe) but probably still represents a realistic consistent contribution value.  Other trainees are set to 75% by default, but their roles vary greatly by department and so you should adjust these based on your own judgement to best reflect the contribution made by these staff in your department."]
[]
[null,null,null,null,null,null,null,null,"Please note: These changes will not be reflected in the worforce data entry matrix in the 'Report Setup' page, however they WILL be reflected in the analyses of the report itself.  You should therefore enter the full FTE of these staff, and not attempt to apportion them yourself."]
[]
[]
[]
[]
[null,"Workforce Data Entry Matrix"]
[]
[]
[null,null,null,null,null,null,null,null,"The Workforce Data Entry Matrix allows you to allocate all of your FTE staffing values by AfC Band (where relevant) for each job role.  "]
[]
[null,null,null,null,null,null,null,null,"You must only enter data into WHITE boxes. "]
[null,null,null,null,null,null,null,null,"Shaded boxes with values are automatically updated to show current subtotals for reference."]
[]
[null,null,null,null,null,null,null,null,"Do not double count staff.  If a member of staff performs a dual role, for example a BMS covers the role of Quality Manager on a 50/50 basis, please apportion their time out as separate FTE for each role (a close estimate is perfectly acceptable) as 0.50 WTE BMS and 0.50 WTE Quality Manager (in this example) etc."]
[]
[]
[]
[]
[null,null,null,null,null,null,null,null,"Your FTE staffing data should include all staff in post at the end of the financial year to which you are reporting, ie it should reflect your staffing position at 31st March 2020.  You should also include staff on long term sick leave and maternity leave, and all vacancies that are actively being advertised.  This means that frozen vacancies, unfunded vacancies and establishment posts that may have been unfilled for some time SHOULD NOT be included."]
[]
[]
[]
[]
[]
[]
[]
[]
[null,null,null,null,null,null,null,null,"Do not include phlebotomy staff, nursing staff, porters, or transport staff, even if they are included in your budget.  The majority of laboratories typically do not carry these costs, and we are looking to achieve comparability in our cost efficiency data analyses."]
[]
[]
[]
[null,null,null,null,null,null,null,null,"Your total staff are listed below for reference, but cannot be amended directly."]
[]
[null,"Calculating Consultant FTE"]
[null,"FTE Consultants should be calculated based only on their PAs which contribute (either directly or indirectly) to the output, productivity and/or service provision of the laboratory.  The FTE figure we use is calculated from the number of PAs that are provided in this way, where 1 PA = 0.10 FTE.  Consultants who work more than 10 PAs will be reflected through >1.00 FTE, for example a Consultant who works 12 Laboratory/Diagnostic PAs per week will pro rata at 1.20 WTE.  Likewise, a Consultant who works 5 Laboratory/Diagnostic Related PAs per week will pro rata at 0.50 WTE.  Salaries calculated by our system will reflect the calculated FTE, not the number of actual people in post.  This will ensure your data are consistent with the rest of our database."]
[]
[null,"PAs related to laboratory/diagnostic work will include obvious areas such as bench work, reporting and interpretation, and laboratory management duties.  They will also include things such as attendance at MDT meetings, laboratory staff training, any activities which involve discussion of a laboratory-generated result with a patient or doctor etc, and in-house teaching (i.e. within the laboratory or involving laboratory staff).  Essentially, these are DCC PAs not funded by a University, a research grant, a clinical trial, private income, or other source outside the Trust/organisation.  We would expect PAs related to areas such as external teaching, private clinics, and research to be excluded."]
[]
[null,"Salary Adjustments For Experience Level"]
[]
[]
[null,null,null,null,null,null,null,null,"This reporting system provides you with the ability to specify a 'typical' experience level profile for each staffing group within the data entry matrix in order to more accurately calculate salaries.  In the interests of making this process as quick and easy as possible to complete it is simply not feasible to make you specify the individual experience level of every member of staff within your department, so we have opted for an approach which will allow you to specify a 'typical' experience level for each key group of staff, based on nationally agreed pay scale definitions."]
[]
[]
[]
[]
[]
[]
[]
[null,null,null,null,null,null,null,null,"These options can be found to the right of the Workforce Data Entry Matrix."]
[null,null,null,null,null,null,null,null,"Please apply a common-sense approach to selecting an option which best represents each group within your workforce.  Remember that the current salary calculations based on the options you have selected against the FTE data entered are displayed for reference underneath the 'total FTE' column at the bottom of the matrix, so if the total feels a little too low or too high then it can be adjusted until it provides a \"best fit\".  If required any finetuning to overall salary can be compensated in the 'Additional Staff Payments' box towards the top of the matrix."]

{"sheet":"Staffing and Finance Data Entry","index":5,"n_rows":74,"n_cols":23,"rows_kept":74,"cut":false,"hidden":false,"merged":[[73,2,73,15],[4,2,4,15],[2,2,2,15],[21,4,23,4],[21,5,23,15],[26,5,26,14],[62,4,66,15],[5,2,5,15],[34,18,34,22],[33,18,33,22],[1,2,1,15],[69,2,69,15],[70,2,70,15]]}
["DO NOT INSERT OR REMOVE ROWS OR COLUMNS"]
[null,null,{"$f":"'General Information'!B2","v":"TBP Laboratory Benchmarking Questionnaire - Clinical Biochemistry"}]
[null,null,"Staffing and Finance Data"]
[]
[null,null,"This year we have taken significant steps to both streamline the data collection process and also deliver more comparable data in your final reports.  For this reason we no longer require you to provide salaries data from your finance department, and have instead built a new system for helping you to calculating salaries based on national standards and pay scale definitions.  There are a series of options provided that will allow you to generate a salary profile for your workforce that will provide an accurate calculation of salaries, but will also allow us the ability to provide 'normalised' pay cost analyses within your reports (in addition to \"actual vs actual\").  In other words, your report will also be able to show you the impact that 'having a staffing profile the same as yours' (in terms of things like on-costs, HCAS, level of experience/time in post for key staff, etc) would have on the cost efficiency of the rest of your peer group."]
[null,null,"For a full tutorial on how to complete this section please refer to the guidance notes"]
[]
[null,null,"Finance Configuration"]
[null,null,"On-Cost Percentage",0.26,"<<<","Enter on-cost value here ('typical' = 26%)"]
[null,null,"Apply High Cost Area Supplement (HCAS)","None","<<<","Applies AfC High Cost Area Supplement costs to mid-point salaries (previously referred to as \"London Weighting\")"]
[null,null,"Additional Staff Payments (eg Out of Hours)",0]
[null,null,"Total Non-Pay",0,"<<<","Please refer to the guidance notes below for calculating non-pay"]
[]
[null,null,"Medical Staff Salary Configuration"]
[null,null,"Set 'Typical' Consultant Profile For This Department","Default (Mid Point)"]
[null,null,"Set 'Typical' Consultant Clinical Excellence 2019 Awards Level (England and Wales Only)","Default (Mid Point)"]
[null,null,"Set 'Typical' Specialist Registrar (SpR) Profile For This Department","Default (Mid Point)","<<<","In order to maintain a consistent UK-wide approach we have retained the 'old' (2002) contract definitions of SpR payscale"]
[null,null,"Set 'Typical' Pay Level for Remaining Other Medical Staff (Using AfC Midpoint as Baseline)","Default (Mid Point)","<<<","Since the specific roles of any 'other medical staff' can vary greatly, we have used AfC scale as a way to easily create comparative average salary calculations (even though these staff will not be paid using an AfC scale)"]
[null,null,"Additional Medical Staff Cost Modifier","+0.0%","<<<","Option to further modify mid-point staff costs from -10% to +10% to allow for impact of part-time staff, locums, additional payments etc"]
[]
[null,null,"Trainee Contribution Weighting"]
[null,null,"Medical Trainees (Junior Doctors, Specialist Registrars)",0.36499999999999999,"<<<","Please note that these options will take effect within the analyses in your reports, but will NOT be reflected in the staffing figures below.  You should enter the actual FTE of your trainees, not a value which you have aggregated yourself based on contribution percentage.  Your 'Total Staff' may therefore differ in the analyses compared with the totals shown below."]
[null,null,"Clinical Scientist Trainees",0.75]
[null,null,"Biomedical Scientist Trainees",0.75]
[null,null,"Apply Workload Weighting to Salary (For Internally Funded Trainees)","No","**NOT SURE THIS ACTUALLY WORKS"]
[]
[null,null,"Staffing FTE Data - Worforce Data Entry Matrix"]
[]
[null,null,"Medical Staff","Total Staff FTE"]
[1,null,"Medical Consultants Incl Locums (Lab/Related FTE Only)",0,"<<<","Must be based on Laboratory/Diagnostic Related PAs only (see below guidance note)"]
[2,null,"Locum Consultants (Lab/Related FTE Only)",0,"<<<","Must be based on Laboratory/Diagnostic Related PAs only (see below guidance note)"]
[3,null,"Junior Doctors/Specialty Trainees (Specialist Registrar/SpR) - Funded Internally",0]
[4,null,"Junior Doctors/Specialty Trainees (Specialist Registrar/SpR) - Funded Externally",0]
[5,null,"Remaining Other Medical Staff",0,null,null,null,null,null,null,null,null,null,null,null,null,null,null,"\"Typical\" Experience Level of Each Staff Group"]
[null,null,null,null,null,null,null,null,null,null,null,null,null,null,null,null,null,null,"(Leave as \"Default\" to set all to mid-point)"]
[null,null,"Clinical Scientists","Total Staff FTE","Band 1","Band 2","Band 3","Band 4","Band 5","Band 6","Band 7","Band 8a","Band 8b","Band 8c","Band 8d","Band 9",null,{"$f":"C36","v":"Clinical Scientists"},"Band 1","Bands 2-4","Band 5","Bands 6-7","Bands 8a+"]
[6,null,"Consultant Clinical Scientists",{"$f":"SUM(E37:P37)","v":0},0,0,0,0,0,0,0,0,0,0,0,0,null,{"$f":"C37","v":"Consultant Clinical Scientists"},"Default","Default","Default","Default","Default"]
[7,null,"Non-Trainee, Non-Consultant Clinical Scientists",{"$f":"SUM(E38:P38)","v":0},0,0,0,0,0,0,0,0,0,0,0,0,null,"Non-Trainee, Non-Consultant Clinical Scientists","Default","Default","Default","Default","Default"]
[8,null,"Trainee Clinical Scientists - Funded Internally",{"$f":"SUM(E39:P39)","v":0},0,0,0,0,0,0,0,0,0,0,0,0,null,"Trainee Clinical Scientists - Funded Internally","Default","Default","Default","Default","Default"]
[9,null,"Trainee Clinical Scientists - Funded Externally",0,0,0,0,0,0,0,0,0,0,0,0,0,null,"Trainee Clinical Scientists - Funded Externally","Default","Default","Default","Default","Default"]
[]
[null,null,"BMS and Other Laboratory Staff","Total Staff FTE","Band 1","Band 2","Band 3","Band 4","Band 5","Band 6","Band 7","Band 8a","Band 8b","Band 8c","Band 8d","Band 9",null,{"$f":"C42","v":"BMS and Other Laboratory Staff"},"Band 1","Bands 2-4","Band 5","Bands 6-7","Bands 8a+"]
[10,null,"Non-Trainee Biomedical Scientists",{"$f":"SUM(E43:P43)","v":0},0,0,0,0,0,0,0,0,0,0,0,0,null,"Non-Trainee Biomedical Scientists","Default","Default","Default","Default","Default"]
[11,null,"Trainee Biomedical Scientists - Funded Internally",0,0,0,0,0,0,0,0,0,0,0,0,0,null,"Trainee Biomedical Scientists - Funded Internally","Default","Default","Default","Default","Default"]
[12,null,"Trainee Biomedical Scientists - Funded Externally",{"$f":"SUM(E45:P45)","v":0},0,0,0,0,0,0,0,0,0,0,0,0,null,"Trainee Biomedical Scientists - Funded Externally","Default","Default","Default","Default","Default"]
[13,null,"Laboratory Support Worker/Medical Laboratory Assistant (MLA)",0,0,0,0,0,0,0,0,0,0,0,0,0,null,"Laboratory Support Worker/Medical Laboratory Assistant (MLA)","Default","Default","Default","Default","Default"]
[14,null,"Associate Practitioners",0,0,0,0,0,0,0,0,0,0,0,0,0,null,"Associate Practitioners","Default","Default","Default","Default","Default"]
[15,null,"Cytoscreeners",0,0,0,0,0,0,0,0,0,0,0,0,0,null,"Cytoscreeners","Default","Default","Default","Default","Default"]
[]
[null,null,"Remaining Other Staff","Total Staff FTE","Band 1","Band 2","Band 3","Band 4","Band 5","Band 6","Band 7","Band 8a","Band 8b","Band 8c","Band 8d","Band 9",null,{"$f":"C50","v":"Remaining Other Staff"},"Band 1","Bands 2-4","Band 5","Bands 6-7","Bands 8a+"]
[16,null,"Administrative and Clerical Staff",{"$f":"SUM(E51:P51)","v":0},0,0,0,0,0,0,0,0,0,0,0,0,null,"Administrative and Clerical Staff","Default","Default","Default","Default","Default"]
[17,null,"Management Staff (Include Clinical Director, Finance Director, Lab Manager etc)",0,0,0,0,0,0,0,0,0,0,0,0,0,null,"Management Staff (Include Clinical Director, Finance Director, Lab Manager etc)","Default","Default","Default","Default","Default"]
[18,null,"Quality Managers (Dedicated Role)",0,0,0,0,0,0,0,0,0,0,0,0,0,null,"Quality Managers (Dedicated Role)","Default","Default","Default","Default","Default"]
[19,null,"IT Staff",0,0,0,0,0,0,0,0,0,0,0,0,0,null,"IT Staff","Default","Default","Default","Default","Default"]
[20,null,"Remaning Other Staff (Exclude Porters, Phlebotomists, Nursing Staff)",0,0,0,0,0,0,0,0,0,0,0,0,0,null,"Remaning Other Staff (Exclude Porters, Phlebotomists, Nursing Staff)","Default","Default","Default","Default","Default"]
[]
[null,null,null,"Total Staff FTE","Band 1","Band 2","Band 3","Band 4","Band 5","Band 6","Band 7","Band 8a","Band 8b","Band 8c","Band 8d","Band 9"]
[21,null,"TOTAL FTE STAFF",{"$f":"SUM(SUM(D30:D34),SUM(D37:D40),SUM(D43:D48),SUM(D51:D55))","v":0},{"$f":"SUM(SUM(E30:E34),SUM(E37:E40),SUM(E43:E48),SUM(E51:E55))","v":0},0,0,0,0,0,0,0,0,0,0,0]
[]
[null,null,"CALCULATED TOTAL PAY (INCLUDING ALL MODIFIERS AND ADDITIONS)",{"$f":"IF('Data Export'!I256=\"XXX\",0,'Data Export'!I256)","v":0}]
[]
[null,null,"Selected Individual Calculated Salaries (For Reference)"]
[null,null,"Medical Staff (Total)",{"$f":"SUM('Data Export'!I235:I239)","v":0},"These salaries are calculated using the options and staffing FTE you have entered above, and will be used in the analyses within this report.  They are provided here for reference to allow you to cross-check the information you have entered so far.  Please note, these cannot be amended directly.  "]
[null,null,"Clinical Scientists (Including Consultants and Trainees)",{"$f":"SUM('Data Export'!I240:I243)","v":0}]
[null,null,"Biomedical Scientists (Including Trainees)",{"$f":"SUM('Data Export'!I244:I247)","v":0}]
[null,null,"Laboratory Support Workers (MLA and Associate Practitioner)",{"$f":"SUM('Data Export'!I248:I249)","v":0}]
[null,null,"Administrative and Clerical Staff",{"$f":"SUM('Data Export'!I251)","v":0}]
[]
[null,null,"Definition of PAs related to 'Laboratory/Diagnostic Work'"]
[null,null,"FTE Consultants should be calculated based only on their PAs which contribute (either directly or indirectly) to the output, productivity and/or service provision of the laboratory.  The FTE figure we use is calculated from the number of PAs that are provided in this way, where 1 PA = 0.10 FTE.  Consultants who work more than 10 PAs will be reflected through >1.00 FTE, for example a Consultant who works 12 Laboratory/Diagnostic PAs per week will pro rata at 1.20 WTE.  Likewise, a Consultant who works 5 Laboratory/Diagnostic Related PAs per week will pro rata at 0.50 WTE.  Salaries calculated by our system will reflect the calculated FTE, not the number of actual people in post.  This will ensure your data are consistent with the rest of our database."]
[null,null,"PAs related to laboratory/diagnostic work will include obvious areas such as bench work, reporting and interpretation, and laboratory management duties.  They will also include things such as attendance at MDT meetings, laboratory staff training, any activities which involve discussion of a laboratory-generated result with a patient or doctor etc, and in-house teaching (i.e. within the laboratory or involving laboratory staff).  Essentially, these are DCC PAs not funded by a University, a research grant, a clinical trial, private income, or other source outside the Trust/organisation.  We would expect PAs related to areas such as external teaching, private clinics, and research to be excluded."]
[]
[null,null,"Calculating Non-Pay"]
[null,null,"Non-pay expenditure should include items such as:  Minor capital purchases (£5,000 or below), leasehold payments, reagents costs, maintenance payments and managed service contract costs, depreciation cost estimates for owned equipment, consumables, travel, course and conference fees, etc.  You should not include capital charge, transport costs, phlebotomy costs or hospital overhead charges."]

{"sheet":"AfC Spine Data","index":6,"n_rows":94,"n_cols":22,"rows_kept":94,"cut":false,"hidden":true,"merged":[[87,2,93,2],[3,2,5,2],[6,2,13,2],[14,2,21,2],[22,2,29,2],[30,2,38,2],[39,2,48,2],[49,2,58,2],[59,2,65,2],[66,2,72,2],[73,2,79,2],[80,2,86,2]]}
[null,null,null,null,null,null,null,null,null,null,"Selected Data"]
[null,null,null,null,null,null,null,null,null,null,"HCAS"]
[null,null,"Band","Previous spine point","Minimum years of experience","2019/20 annual value (£)","including Inner London HCAS","including Outer London HCAS","including Fringe HCAS",null,{"$f":"'Staffing and Finance Data Entry'!D10","v":"None"},"With on-costs","Modifier 2","Final Figure",null,"Band","Term","CON lookup","Salary",null,null,"Trainees Reduction Salary Value"]
[null,null,"Band 1",2,"< 1 year",17652,22052,21374,18669,null,{"$f":"IF(K$3=\"None\",$F4,IF(K$3=$G$3,$G4,IF(K$3=$H$3,$H4,IF(K$3=$I$3,$I4,$F4))))","v":17652},{"$f":"SUM(K4,SUM(K4*'Staffing and Finance Data Entry'!$D$9))","v":22241.52},{"$f":"L4","v":22241.52},{"$f":"M4","v":22241.52},null,1,"<1 Year",{"$f":"CONCATENATE(P4,\"-\",Q4)","v":"1-<1 Year"},{"$f":"N4","v":22241.52},null,"Medical Trainees",{"$f":"IF('Staffing and Finance Data Entry'!$D$25=\"Yes\",'Staffing and Finance Data Entry'!D22,100%)","v":1}]
[null,null,null,null,"Default",{"$f":"F4","v":17652},{"$f":"G4","v":22052},21374,18669,null,{"$f":"IF(K$3=\"None\",$F5,IF(K$3=$G$3,$G5,IF(K$3=$H$3,$H5,IF(K$3=$I$3,$I5,$F5))))","v":17652},{"$f":"SUM(K5,SUM(K5*'Staffing and Finance Data Entry'!$D$9))","v":22241.52},{"$f":"L5","v":22241.52},22241.52,null,1,"Default",{"$f":"CONCATENATE(P5,\"-\",Q5)","v":"1-Default"},{"$f":"N5","v":22241.52},null,"Clinical Scientist Trainees",{"$f":"IF('Staffing and Finance Data Entry'!$D$25=\"Yes\",'Staffing and Finance Data Entry'!D23,100%)","v":1}]
[null,null,null,3,"1+ years",17652,22052,21374,18669,null,17652,{"$f":"SUM(K6,SUM(K6*'Staffing and Finance Data Entry'!$D$9))","v":22241.52},22241.52,22241.52,null,1,"1+ Years","1-1+ Years",22241.52,null,"Biomedical Scientist Trainnes",{"$f":"IF('Staffing and Finance Data Entry'!$D$25=\"Yes\",'Staffing and Finance Data Entry'!D24,100%)","v":1}]
[null,null,"Band 2",2,"< 1 year ",17652,22052,21374,18669,null,17652,{"$f":"SUM(K7,SUM(K7*'Staffing and Finance Data Entry'!$D$9))","v":22241.52},22241.52,22241.52,null,2,"<1 Year","2-<1 Year",22241.52]
[null,null,null,3,"1 - 2 years",17652,22052,21374,18669,null,17652,{"$f":"SUM(K8,SUM(K8*'Staffing and Finance Data Entry'!$D$9))","v":22241.52},22241.52,22241.52,null,2,"1-2 Years","2-1-2 Years",22241.52]
[null,null,null,4,"2 - 3 years",17652,22052,21374,18669,null,17652,{"$f":"SUM(K9,SUM(K9*'Staffing and Finance Data Entry'!$D$9))","v":22241.52},22241.52,22241.52,null,2,"2-3 Years","2-2-3 Years",22241.52]
[null,null,null,5,"3 - 4 years",17652,22052,21374,18669,null,17652,{"$f":"SUM(K10,SUM(K10*'Staffing and Finance Data Entry'!$D$9))","v":22241.52},22241.52,22241.52,null,2,"3-4 Years","2-3-4 Years",22241.52]
[null,null,null,null,"Default",{"$f":"F10","v":17652},{"$f":"G10","v":22052},21374,18669,null,17652,{"$f":"SUM(K11,SUM(K11*'Staffing and Finance Data Entry'!$D$9))","v":22241.52},22241.52,22241.52,null,2,"Default","2-Default",22241.52]
[null,null,null,6,"4 - 5 years",17652,22052,21374,18669,null,17652,{"$f":"SUM(K12,SUM(K12*'Staffing and Finance Data Entry'!$D$9))","v":22241.52},22241.52,22241.52,null,2,"4-5 Years","2-4-5 Years",22241.52]
[null,null,null,7,"5 - 6 years",17983,22383,21705,19000,null,17983,{"$f":"SUM(K13,SUM(K13*'Staffing and Finance Data Entry'!$D$9))","v":22658.58},22658.58,22658.58,null,2,"5-6 Years","2-5-6 Years",22658.58]
[null,null,null,8,"6+ years",19020,23420,22742,20037,null,19020,{"$f":"SUM(K14,SUM(K14*'Staffing and Finance Data Entry'!$D$9))","v":23965.200000000001},23965.200000000001,23965.200000000001,null,2,"6+ Years","2-6+ Years",23965.200000000001]
[null,null,"Band 3",6,"< 1 year ",18813,23213,22535,19830,null,18813,{"$f":"SUM(K15,SUM(K15*'Staffing and Finance Data Entry'!$D$9))","v":23704.38},23704.38,23704.38,null,3,"<1 Year","3-<1 Year",23704.38]
[null,null,null,7,"1 - 2 years",18813,23213,22535,19830,null,18813,{"$f":"SUM(K16,SUM(K16*'Staffing and Finance Data Entry'!$D$9))","v":23704.38},23704.38,23704.38,null,3,"1-2 Years","3-1-2 Years",23704.38]
[null,null,null,8,"2 - 3 years",18813,23213,22535,19830,null,18813,{"$f":"SUM(K17,SUM(K17*'Staffing and Finance Data Entry'!$D$9))","v":23704.38},23704.38,23704.38,null,3,"2-3 Years","3-2-3 Years",23704.38]
[null,null,null,9,"3 - 4 years",18813,23213,22535,19830,null,18813,{"$f":"SUM(K18,SUM(K18*'Staffing and Finance Data Entry'!$D$9))","v":23704.38},23704.38,23704.38,null,3,"3-4 Years","3-3-4 Years",23704.38]
[null,null,null,null,"Default",{"$f":"F18","v":18813},{"$f":"G18","v":23213},22535,19830,null,18813,{"$f":"SUM(K19,SUM(K19*'Staffing and Finance Data Entry'!$D$9))","v":23704.38},23704.38,23704.38,null,3,"Default","3-Default",23704.38]
[null,null,null,10,"4 - 5 years",19332,23732,23054,20349,null,19332,{"$f":"SUM(K20,SUM(K20*'Staffing and Finance Data Entry'!$D$9))","v":24358.32},24358.32,24358.32,null,3,"4-5 Years","3-4-5 Years",24358.32]
[null,null,null,11,"5 - 6 years",19917,24317,23639,20934,null,19917,{"$f":"SUM(K21,SUM(K21*'Staffing and Finance Data Entry'!$D$9))","v":25095.42},25095.42,25095.42,null,3,"5-6 Years","3-5-6 Years",25095.42]
[null,null,null,12," 6+ years",20795,25195,24517,21834.75,null,20795,{"$f":"SUM(K22,SUM(K22*'Staffing and Finance Data Entry'!$D$9))","v":26201.7},26201.7,26201.7,null,3,"6+ Years","3-6+ Years",26201.7]
[null,null," Band 4",11,"< 1 year",21089,25489,24811,22143.45,null,21089,{"$f":"SUM(K23,SUM(K23*'Staffing and Finance Data Entry'!$D$9))","v":26572.14},26572.14,26572.14,null,4,"<1 Year","4-<1 Year",26572.14]
[null,null,null,12,"1 - 2 years",21089,25489,24811,22143.45,null,21089,{"$f":"SUM(K24,SUM(K24*'Staffing and Finance Data Entry'!$D$9))","v":26572.14},26572.14,26572.14,null,4,"1-2 Years","4-1-2 Years",26572.14]
[null,null,null,13,"2 - 3 years",21089,25489,24811,22143.45,null,21089,{"$f":"SUM(K25,SUM(K25*'Staffing and Finance Data Entry'!$D$9))","v":26572.14},26572.14,26572.14,null,4,"2-3 Years","4-2-3 Years",26572.14]
[null,null,null,14,"3 - 4 years",21819,26219,25541,22909.95,null,21819,{"$f":"SUM(K26,SUM(K26*'Staffing and Finance Data Entry'!$D$9))","v":27491.940000000002},27491.940000000002,27491.940000000002,null,4,"3-4 Years","4-3-4 Years",27491.940000000002]
[null,null,null,null,"Default",{"$f":"F26","v":21819},{"$f":"G26","v":26219},{"$f":"H26","v":25541},{"$f":"I26","v":22909.95},null,21819,{"$f":"SUM(K27,SUM(K27*'Staffing and Finance Data Entry'!$D$9))","v":27491.940000000002},27491.940000000002,27491.940000000002,null,4,"Default","4-Default",27491.940000000002]
[null,null,null,15,"4 - 5 years",22482,26978.400000000001,26204,23606.1,null,22482,{"$f":"SUM(K28,SUM(K28*'Staffing and Finance Data Entry'!$D$9))","v":28327.32},28327.32,28327.32,null,4,"4-5 Years","4-4-5 Years",28327.32]
[null,null,null,16,"5 - 6 years",22707,27248.400000000001,26429,23842.35,null,22707,{"$f":"SUM(K29,SUM(K29*'Staffing and Finance Data Entry'!$D$9))","v":28610.82},28610.82,28610.82,null,4,"5-6 Years","4-5-6 Years",28610.82]
[null,null,null,17,"6+ years",23761,28513.200000000001,27483,24949.05,null,23761,{"$f":"SUM(K30,SUM(K30*'Staffing and Finance Data Entry'!$D$9))","v":29938.86},29938.86,29938.86,null,4,"6+ Years","4-6+ Years",29938.86]
[null,null,"Band 5",16,"< 1 year",24214,29056.799999999999,27936,25424.7,null,24214,{"$f":"SUM(K31,SUM(K31*'Staffing and Finance Data Entry'!$D$9))","v":30509.64},30509.64,30509.64,null,5,"<1 Year","5-<1 Year",30509.64]
[null,null,null,17,"1 - 2 years",24214,29056.799999999999,27936,25424.7,null,24214,{"$f":"SUM(K32,SUM(K32*'Staffing and Finance Data Entry'!$D$9))","v":30509.64},30509.64,30509.64,null,5,"1-2 Years","5-1-2 Years",30509.64]
[null,null,null,18,"2 - 3 years",24214,29056.799999999999,27936,25424.7,null,24214,{"$f":"SUM(K33,SUM(K33*'Staffing and Finance Data Entry'!$D$9))","v":30509.64},30509.64,30509.64,null,5,"2-3 Years","5-2-3 Years",30509.64]
[null,null,null,19,"3 - 4 years",26220,31464,30153,27531,null,26220,{"$f":"SUM(K34,SUM(K34*'Staffing and Finance Data Entry'!$D$9))","v":33037.199999999997},33037.199999999997,33037.199999999997,null,5,"3-4 Years","5-3-4 Years",33037.199999999997]
[null,null,null,null,"Default",{"$f":"F34","v":26220},{"$f":"G34","v":31464},{"$f":"H34","v":30153},{"$f":"I34","v":27531},null,26220,{"$f":"SUM(K35,SUM(K35*'Staffing and Finance Data Entry'!$D$9))","v":33037.199999999997},33037.199999999997,33037.199999999997,null,5,"Default","5-Default",33037.199999999997]
[null,null,null,20,"4 - 5 years",26220,31464,30153,27531,null,26220,{"$f":"SUM(K36,SUM(K36*'Staffing and Finance Data Entry'!$D$9))","v":33037.199999999997},33037.199999999997,33037.199999999997,null,5,"4-5 Years","5-4-5 Years",33037.199999999997]
[null,null,null,21,"5 - 6 years",27260,32712,31349,28623,null,27260,{"$f":"SUM(K37,SUM(K37*'Staffing and Finance Data Entry'!$D$9))","v":34347.599999999999},34347.599999999999,34347.599999999999,null,5,"5-6 Years","5-5-6 Years",34347.599999999999]
[null,null,null,22," 6 - 7 years",28358,34029.599999999999,32611.7,29775.9,null,28358,{"$f":"SUM(K38,SUM(K38*'Staffing and Finance Data Entry'!$D$9))","v":35731.08},35731.08,35731.08,null,5,"6-7 Years","5-6-7 Years",35731.08]
[null,null,null,23,"7+ years",30112,36134.400000000001,34628.800000000003,31617.599999999999,null,30112,{"$f":"SUM(K39,SUM(K39*'Staffing and Finance Data Entry'!$D$9))","v":37941.120000000003},37941.120000000003,37941.120000000003,null,5,"7+ Years","5-7+ Years",37941.120000000003]
[null,null,"Band 6",21,"< 1 year",30401,36481.199999999997,34961.15,31921.05,null,30401,{"$f":"SUM(K40,SUM(K40*'Staffing and Finance Data Entry'!$D$9))","v":38305.26},38305.26,38305.26,null,6,"<1 Year","6-<1 Year",38305.26]
[null,null,null,22,"1 - 2 years",30401,36481.199999999997,34961.15,31921.05,null,30401,{"$f":"SUM(K41,SUM(K41*'Staffing and Finance Data Entry'!$D$9))","v":38305.26},38305.26,38305.26,null,6,"1-2 Years","6-1-2 Years",38305.26]
[null,null,null,23,"2 - 3 years",30401,36481.199999999997,34961.15,31921.05,null,30401,{"$f":"SUM(K42,SUM(K42*'Staffing and Finance Data Entry'!$D$9))","v":38305.26},38305.26,38305.26,null,6,"2-3 Years","6-2-3 Years",38305.26]
[null,null,null,24,"3 - 4 years",32525,39030,37268,34151.25,null,32525,{"$f":"SUM(K43,SUM(K43*'Staffing and Finance Data Entry'!$D$9))","v":40981.5},40981.5,40981.5,null,6,"3-4 Years","6-3-4 Years",40981.5]
[null,null,null,25,"4 - 5 years",32525,39030,37268,34151.25,null,32525,{"$f":"SUM(K44,SUM(K44*'Staffing and Finance Data Entry'!$D$9))","v":40981.5},40981.5,40981.5,null,6,"4-5 Years","6-4-5 Years",40981.5]
[null,null,null,null,"Default",{"$f":"F44","v":32525},{"$f":"G44","v":39030},{"$f":"H44","v":37268},{"$f":"I44","v":34151.25},null,32525,{"$f":"SUM(K45,SUM(K45*'Staffing and Finance Data Entry'!$D$9))","v":40981.5},40981.5,40981.5,null,6,"Default","6-Default",40981.5]
[null,null,null,26,"5 - 6 years",32525,39030,37268,34151.25,null,32525,{"$f":"SUM(K46,SUM(K46*'Staffing and Finance Data Entry'!$D$9))","v":40981.5},40981.5,40981.5,null,6,"5-6 Years","6-5-6 Years",40981.5]
[null,null,null,27,"6 - 7 years",33587,40304.400000000001,38330,35266.35,null,33587,{"$f":"SUM(K47,SUM(K47*'Staffing and Finance Data Entry'!$D$9))","v":42319.62},42319.62,42319.62,null,6,"6-7 Years","6-6-7 Years",42319.62]
[null,null,null,28,"7 - 8 years",34782,41559,39525,36521.1,null,34782,{"$f":"SUM(K48,SUM(K48*'Staffing and Finance Data Entry'!$D$9))","v":43825.32},43825.32,43825.32,null,6,"7-8 Years","6-7-8 Years",43825.32]
[null,null,null,29,"8+ years",37267,44044,42010,39029,null,37267,{"$f":"SUM(K49,SUM(K49*'Staffing and Finance Data Entry'!$D$9))","v":46956.42},46956.42,46956.42,null,6,"8+ Years","6-8+ Years",46956.42]
[null,null,"Band 7",26,"< 1 year",37570,44347,42313,39332,null,37570,{"$f":"SUM(K50,SUM(K50*'Staffing and Finance Data Entry'!$D$9))","v":47338.2},47338.2,47338.2,null,7,"<1 Year","7-<1 Year",47338.2]
[null,null,null,27,"1 - 2 years",37570,44347,42313,39332,null,37570,{"$f":"SUM(K51,SUM(K51*'Staffing and Finance Data Entry'!$D$9))","v":47338.2},47338.2,47338.2,null,7,"1-2 Years","7-1-2 Years",47338.2]
[null,null,null,28,"2 - 3 years",37570,44347,42313,39332,null,37570,{"$f":"SUM(K52,SUM(K52*'Staffing and Finance Data Entry'!$D$9))","v":47338.2},47338.2,47338.2,null,7,"2-3 Years","7-2-3 Years",47338.2]
[null,null,null,29,"3 - 4 years",37570,44347,42313,39332,null,37570,{"$f":"SUM(K53,SUM(K53*'Staffing and Finance Data Entry'!$D$9))","v":47338.2},47338.2,47338.2,null,7,"3-4 Years","7-3-4 Years",47338.2]
[null,null,null,30,"4 - 5 years",38765,45542,43508,40527,null,38765,{"$f":"SUM(K54,SUM(K54*'Staffing and Finance Data Entry'!$D$9))","v":48843.9},48843.9,48843.9,null,7,"4-5 Years","7-4-5 Years",48843.9]
[null,null,null,null,"Default",{"$f":"F54","v":38765},{"$f":"G54","v":45542},{"$f":"H54","v":43508},{"$f":"I54","v":40527},null,38765,{"$f":"SUM(K55,SUM(K55*'Staffing and Finance Data Entry'!$D$9))","v":48843.9},48843.9,48843.9,null,7,"Default","7-Default",48843.9]
[null,null,null,31,"5 - 6 years",38765,45542,43508,40527,null,38765,{"$f":"SUM(K56,SUM(K56*'Staffing and Finance Data Entry'!$D$9))","v":48843.9},48843.9,48843.9,null,7,"5-6 Years","7-5-6 Years",48843.9]
[null,null,null,32,"6 - 7 years",40092,46869,44835,41854,null,40092,{"$f":"SUM(K57,SUM(K57*'Staffing and Finance Data Entry'!$D$9))","v":50515.92},50515.92,50515.92,null,7,"6-7 Years","7-6-7 Years",50515.92]
[null,null,null,33,"7 - 8 years",41486,48263,46229,43248,null,41486,{"$f":"SUM(K58,SUM(K58*'Staffing and Finance Data Entry'!$D$9))","v":52272.36},52272.36,52272.36,null,7,"7-8 Years","7-7-8 Years",52272.36]
[null,null,null,34,"8+ years",43772,50549,48515,45534,null,43772,{"$f":"SUM(K59,SUM(K59*'Staffing and Finance Data Entry'!$D$9))","v":55152.72},55152.72,55152.72,null,7,"8+ Years","7-8+ Years",55152.72]
[null,null,"Band 8a",33," < 1 year",44606,51383,49349,46368,null,44606,{"$f":"SUM(K60,SUM(K60*'Staffing and Finance Data Entry'!$D$9))","v":56203.56},56203.56,56203.56,null,"8a","<1 Year","8a-<1 Year",56203.56]
[null,null,null,34,"1 - 2 years",44606,51383,49349,46368,null,44606,{"$f":"SUM(K61,SUM(K61*'Staffing and Finance Data Entry'!$D$9))","v":56203.56},56203.56,56203.56,null,"8a","1-2 Years","8a-1-2 Years",56203.56]
[null,null,null,35,"2 - 3 years",44606,51383,49349,46368,null,44606,{"$f":"SUM(K62,SUM(K62*'Staffing and Finance Data Entry'!$D$9))","v":56203.56},56203.56,56203.56,null,"8a","2-3 Years","8a-2-3 Years",56203.56]
[null,null,null,null,"Default",{"$f":"AVERAGE(F62,F64)","v":45468.5},{"$f":"AVERAGE(G62,G64)","v":52245.5},50211.5,47230.5,null,45468.5,{"$f":"SUM(K63,SUM(K63*'Staffing and Finance Data Entry'!$D$9))","v":57290.31},57290.31,57290.31,null,"8a","Default","8a-Default",57290.31]
[null,null,null,36,"3 - 4 years",46331,53108,51074,48093,null,46331,{"$f":"SUM(K64,SUM(K64*'Staffing and Finance Data Entry'!$D$9))","v":58377.06},58377.06,58377.06,null,"8a","3-4 Years","8a-3-4 Years",58377.06]
[null,null,null,37,"4 - 5 years",48324,55101,53067,50086,null,48324,{"$f":"SUM(K65,SUM(K65*'Staffing and Finance Data Entry'!$D$9))","v":60888.24},60888.24,60888.24,null,"8a","4-5 Years","8a-4-5 Years",60888.24]
[null,null,null,38,"5+ years",50819,57596,55562,52581,null,50819,{"$f":"SUM(K66,SUM(K66*'Staffing and Finance Data Entry'!$D$9))","v":64031.94},64031.94,64031.94,null,"8a","5+ Years","8a-5+ Years",64031.94]
[null,null,"Band 8b",37,"< 1 year",52306,59083,"57,049 ",54068,null,52306,{"$f":"SUM(K67,SUM(K67*'Staffing and Finance Data Entry'!$D$9))","v":65905.56},65905.56,65905.56,null,"8b","<1 Year","8b-<1 Year",65905.56]
[null,null,null,38,"1 - 2 years",52306,59083,57049,54068,null,52306,{"$f":"SUM(K68,SUM(K68*'Staffing and Finance Data Entry'!$D$9))","v":65905.56},65905.56,65905.56,null,"8b","1-2 Years","8b-1-2 Years",65905.56]
[null,null,null,39,"2 - 3 years",52306,59083,57049,54068,null,{"$f":"IF(K$3=\"None\",$F69,IF(K$3=$G$3,$G69,IF(K$3=$H$3,$H69,IF(K$3=$I$3,$I69,$F69))))","v":52306},{"$f":"SUM(K69,SUM(K69*'Staffing and Finance Data Entry'!$D$9))","v":65905.56},{"$f":"L69","v":65905.56},65905.56,null,"8b","2-3 Years",{"$f":"CONCATENATE(P69,\"-\",Q69)","v":"8b-2-3 Years"},{"$f":"N69","v":65905.56}]
[null,null,null,null,"Default",{"$f":"AVERAGE(F69,F71)","v":53766},{"$f":"AVERAGE(G69,G71)","v":60543},{"$f":"AVERAGE(H69,H71)","v":58509},{"$f":"AVERAGE(I69,I71)","v":55528},null,53766,{"$f":"SUM(K70,SUM(K70*'Staffing and Finance Data Entry'!$D$9))","v":67745.16},67745.16,67745.16,null,"8b","Default","8b-Default",67745.16]
[null,null,null,40,"3 - 4 years",55226,62003,59969,56988,null,55226,{"$f":"SUM(K71,SUM(K71*'Staffing and Finance Data Entry'!$D$9))","v":69584.759999999995},69584.759999999995,69584.759999999995,null,"8b","3-4 Years","8b-3-4 Years",69584.759999999995]
[null,null,null,41,"4 - 5 years",58148,64925,62891,59910,null,58148,{"$f":"SUM(K72,SUM(K72*'Staffing and Finance Data Entry'!$D$9))","v":73266.48},73266.48,73266.48,null,"8b","4-5 Years","8b-4-5 Years",73266.48]
[null,null,null,42,"5+ years",60983,67760,65726,62745,null,60983,{"$f":"SUM(K73,SUM(K73*'Staffing and Finance Data Entry'!$D$9))","v":76838.58},76838.58,76838.58,null,"8b","5+ Years","8b-5+ Years",76838.58]
[null,null,"Band 8c",41,"< 1 year",61777,68554,66520,63539,null,61777,{"$f":"SUM(K74,SUM(K74*'Staffing and Finance Data Entry'!$D$9))","v":77839.02},77839.02,77839.02,null,"8c","<1 Year","8c-<1 Year",77839.02]
[null,null,null,42,"1 - 2 years",61777,68554,66520,63539,null,61777,{"$f":"SUM(K75,SUM(K75*'Staffing and Finance Data Entry'!$D$9))","v":77839.02},77839.02,77839.02,null,"8c","1-2 Years","8c-1-2 Years",77839.02]
[null,null,null,43,"2 - 3 years",61777,68554,66520,63539,null,61777,{"$f":"SUM(K76,SUM(K76*'Staffing and Finance Data Entry'!$D$9))","v":77839.02},77839.02,77839.02,null,"8c","2-3 Years","8c-2-3 Years",77839.02]
[null,null,null,null,"Default",{"$f":"AVERAGE(F76,F78)","v":63223.5},{"$f":"AVERAGE(G76,G78)","v":70000.5},{"$f":"AVERAGE(H76,H78)","v":67966.5},{"$f":"AVERAGE(I76,I78)","v":64985.5},null,63223.5,{"$f":"SUM(K77,SUM(K77*'Staffing and Finance Data Entry'!$D$9))","v":79661.61},79661.61,79661.61,null,"8c","Default","8c-Default",79661.61]
[null,null,null,44,"3- 4 years",64670,71447,69413,66432,null,64670,{"$f":"SUM(K78,SUM(K78*'Staffing and Finance Data Entry'!$D$9))","v":81484.2},81484.2,81484.2,null,"8c","3-4 Years","8c-3-4 Years",81484.2]
[null,null,null,45,"4 - 5 years",69007,75784,73750,70769,null,69007,{"$f":"SUM(K79,SUM(K79*'Staffing and Finance Data Entry'!$D$9))","v":86948.82},86948.82,86948.82,null,"8c","4-5 Years","8c-4-5 Years",86948.82]
[null,null,null,46,"5+ years",72597,79374,77340,74359,null,72597,{"$f":"SUM(K80,SUM(K80*'Staffing and Finance Data Entry'!$D$9))","v":91472.22},91472.22,91472.22,null,"8c","5+ Years","8c-5+ Years",91472.22]
[null,null,"Band 8d",45,"< 1 year",73936,80713,78679,75698,null,73936,{"$f":"SUM(K81,SUM(K81*'Staffing and Finance Data Entry'!$D$9))","v":93159.360000000001},93159.360000000001,93159.360000000001,null,"8d","<1 Year","8d-<1 Year",93159.360000000001]
[null,null,null,46,"1 - 2 years",73936,80713,78679,75698,null,73936,{"$f":"SUM(K82,SUM(K82*'Staffing and Finance Data Entry'!$D$9))","v":93159.360000000001},93159.360000000001,93159.360000000001,null,"8d","1-2 Years","8d-1-2 Years",93159.360000000001]
[null,null,null,47,"2 - 3 years",73936,80713,78679,75698,null,73936,{"$f":"SUM(K83,SUM(K83*'Staffing and Finance Data Entry'!$D$9))","v":93159.360000000001},93159.360000000001,93159.360000000001,null,"8d","2-3 Years","8d-2-3 Years",93159.360000000001]
[null,null,null,null,"Default",{"$f":"AVERAGE(F83,F85)","v":75743},{"$f":"AVERAGE(G83,G85)","v":82520},{"$f":"AVERAGE(H83,H85)","v":80486},{"$f":"AVERAGE(I83,I85)","v":77505},null,75743,{"$f":"SUM(K84,SUM(K84*'Staffing and Finance Data Entry'!$D$9))","v":95436.18},95436.18,95436.18,null,"8d","Default","8d-Default",95436.18]
[null,null,null,48,"3- 4 years",77550,84327,82293,79312,null,77550,{"$f":"SUM(K85,SUM(K85*'Staffing and Finance Data Entry'!$D$9))","v":97713},97713,97713,null,"8d","3-4 Years","8d-3-4 Years",97713]
[null,null,null,49,"4 - 5 years",81493,88270,86236,83255,null,81493,{"$f":"SUM(K86,SUM(K86*'Staffing and Finance Data Entry'!$D$9))","v":102681.18},102681.18,102681.18,null,"8d","4-5 Years","8d-4-5 Years",102681.18]
[null,null,null,50,"5+ years",86687,93464,91430,88449,null,86687,{"$f":"SUM(K87,SUM(K87*'Staffing and Finance Data Entry'!$D$9))","v":109225.62},109225.62,109225.62,null,"8d","5+ Years","8d-5+ Years",109225.62]
[null,null,"Band 9",49,"< 1 year",89537,96314,94280,91299,null,89537,{"$f":"SUM(K88,SUM(K88*'Staffing and Finance Data Entry'!$D$9))","v":112816.62},112816.62,112816.62,null,9,"<1 Year","9-<1 Year",112816.62]
[null,null,null,50,"1 - 2 years ",89537,96314,94280,91299,null,89537,{"$f":"SUM(K89,SUM(K89*'Staffing and Finance Data Entry'!$D$9))","v":112816.62},112816.62,112816.62,null,9,"1-2 Years","9-1-2 Years",112816.62]
[null,null,null,51,"2 - 3 years",89537,96314,94280,91299,null,89537,{"$f":"SUM(K90,SUM(K90*'Staffing and Finance Data Entry'!$D$9))","v":112816.62},112816.62,112816.62,null,9,"2-3 Years","9-2-3 Years",112816.62]
[null,null,null,null,"Default",{"$f":"AVERAGE(F90,F92)","v":91686},{"$f":"AVERAGE(G90,G92)","v":98463},{"$f":"AVERAGE(H90,H92)","v":96429},{"$f":"AVERAGE(I90,I92)","v":93448},null,91686,{"$f":"SUM(K91,SUM(K91*'Staffing and Finance Data Entry'!$D$9))","v":115524.36},115524.36,115524.36,null,9,"Default","9-Default",115524.36]
[null,null,null,52,"3- 4 years",93835,100612,98578,95597,null,93835,{"$f":"SUM(K92,SUM(K92*'Staffing and Finance Data Entry'!$D$9))","v":118232.1},118232.1,118232.1,null,9,"3-4 Years","9-3-4 Years",118232.1]
[null,null,null,53,"4 - 5 years",98339,105116,103082,100101,null,98339,{"$f":"SUM(K93,SUM(K93*'Staffing and Finance Data Entry'!$D$9))","v":123907.14},123907.14,123907.14,null,9,"4-5 Years","9-4-5 Years",123907.14]
[null,null,null,54,"5+ years",103860,110637,108603,105622,null,103860,{"$f":"SUM(K94,SUM(K94*'Staffing and Finance Data Entry'!$D$9))","v":130863.6},130863.6,130863.6,null,9,"5+ Years","9-5+ Years",130863.6]

{"sheet":"lists","index":7,"n_rows":164,"n_cols":22,"rows_kept":164,"cut":false,"hidden":true,"merged":[]}
[null,null,null,null,null,null,null,null,null,null,"Experience Level"]
[null,"Complexity","Staff Cost Modifier",null,null,"Discipline","Disc No","Disc Codes","Source of Workload Lookup",null,"Band 1","Bands 2-4","Band 5","Bands 6-7","Bands 8a+",null,"HCAS","Diagnostics","Consultants","Consultants Clinical Excellence","SpR Profiles","Other Medical Staff"]
[null,"9 (Highest)","+0.0%",1.0000000000000084,null,"Chemistry",1,"CH",{"$f":"G3","v":1},null,"Default","Default","Default","Default","Default",null,"None","Not Selected","Default (Mid Point)","Exclude","Default (Mid Point)","Default (Mid Point)"]
[null,"8 (Top Decile)","+40.0%",1.4,null,"Haematology",2,"HA",{"$f":"G4","v":2},null,"<1 Year","<1 Year","<1 Year","<1 Year","<1 Year",null,"including Inner London HCAS","Siemens","2003 Contract: (starting salary)","Default (Mid Point)","Min: £31,841","AfC1"]
[null,"7 (Top Quartile)","+39.5%",1.395,null,"Immunology",3,"IM",3,null,"1+ Years","1-2 Years","1-2 Years","1-2 Years","1-2 Years",null,"including Outer London HCAS","Others","2003 Contract: (1 year completed as consultan","Level 1","1: £33,790","AfC2"]
[null,"6 (Just Above Average)","+39.0%",1.3900000000000001,null,"Combined Blood Sciences",4,"BS",5,null,null,"2-3 Years","2-3 Years","2-3 Years","2-3 Years",null,"including Fringe HCAS",null,"2003 Contract: (2 years completed)","Level 2","2: £36,511","AfC3"]
[null,"5 (Average)","+38.5%",1.3850000000000002,null,"Microbiology",5,"MI",4,null,null,"3-4 Years","3-4 Years","3-4 Years","3-4 Years",null,null,null,"2003 Contract: (3 years completed)","Level 3","3: £38,156","AfC4"]
[null,"4 (Just Below Average)","+38.0%",1.3800000000000003,null,"Cellular Pathology",6,"HC",8,null,null,"4-5 Years","4-5 Years","4-5 Years","4-5 Years",null,null,null,"2003 Contract: (4-8 years completed)","Level 4","4: £40,141","AfC5"]
[null,"3 (Lower Quartile)","+37.5%",1.3750000000000004,null,"Histopathology",7,"HI",6,null,null,"5-6 Years","5-6 Years","5-6 Years","5+ Years",null,null,null,"2003 Contract: (9-13 years completed)","Level 5","5: £42,126","AfC6"]
[null,"2 (Lower Decile)","+37.0%",1.3700000000000006,null,"Cytology",8,"CY",7,null,null,"6+ Years","6-7 Years","6-7 Years",null,null,null,null,"2003 Contract: (14-18 years completed)","Level 6","6: £44,112","AfC7"]
[null,"1 (Lowest)","+36.5%",1.3650000000000007,null,null,null,null,null,null,null,null,"7+ Years","7-8 Years",null,null,null,null,"2003 Contract: (19 years completed)","Level 7","7: £46,096","AfC8a"]
[null,null,"+36.0%",1.3600000000000008,null,null,null,null,null,null,null,null,null,"8+ Years",null,null,null,null,"Pre 2003: Basic","Level 8","8: £48,082","AfC8b"]
[null,null,"+35.5%",1.3550000000000009,null,null,null,null,null,null,null,null,null,null,null,null,null,null,"Pre 2003: 1","Level 9 or Bronze","9: £50,068","AfC8c"]
[null,null,"+35.0%",1.350000000000001,null,null,null,null,null,null,null,null,null,null,null,null,null,null,"Pre 2003: 2","Level 10 or Silver",null,"AfC8d"]
[null,null,"+34.5%",1.3450000000000011,null,null,null,null,null,null,null,null,null,null,null,null,null,null,"Pre 2003: 3","Level 11 or Gold",null,"AfC9"]
[null,null,"+34.0%",1.3400000000000012,null,null,null,null,null,null,null,null,null,null,null,null,null,null,"Pre 2003: 4","Level 12 or Platinum"]
[null,null,"+33.5%",1.3350000000000013]
[null,null,"+33.0%",1.3300000000000014]
[null,null,"+32.5%",1.3250000000000015]
[null,null,"+32.0%",1.3200000000000016]
[null,null,"+31.5%",1.3150000000000017]
[null,null,"+31.0%",1.3100000000000018]
[null,null,"+30.5%",1.3050000000000019]
[null,null,"+30.0%",1.300000000000002]
[null,null,"+29.5%",1.2950000000000021]
[null,null,"+29.0%",1.2900000000000023]
[null,null,"+28.5%",1.2850000000000024]
[null,null,"+28.0%",1.2800000000000025]
[null,null,"+27.5%",1.2750000000000026]
[null,null,"+27.0%",1.2700000000000027]
[null,null,"+26.5%",1.2650000000000028]
[null,null,"+26.0%",1.2600000000000029]
[null,null,"+25.5%",1.255000000000003]
[null,null,"+25.0%",1.2500000000000031]
[null,null,"+24.5%",1.2450000000000032]
[null,null,"+24.0%",1.2400000000000033]
[null,null,"+23.5%",1.2350000000000034]
[null,null,"+23.0%",1.2300000000000035]
[null,null,"+22.5%",1.2250000000000036]
[null,null,"+22.0%",1.2200000000000037]
[null,null,"+21.5%",1.2150000000000039]
[null,null,"+21.0%",1.210000000000004]
[null,null,"+20.5%",1.2050000000000041]
[null,null,"+20.0%",1.2000000000000042]
[null,null,"+19.5%",1.1950000000000043]
[null,null,"+19.0%",1.1900000000000044]
[null,null,"+18.5%",1.1850000000000045]
[null,null,"+18.0%",1.1800000000000046]
[null,null,"+17.5%",1.1750000000000047]
[null,null,"+17.0%",1.1700000000000048]
[null,null,"+16.5%",1.1650000000000049]
[null,null,"+16.0%",1.160000000000005]
[null,null,"+15.5%",1.1550000000000051]
[null,null,"+15.0%",1.1500000000000052]
[null,null,"+14.5%",1.1450000000000053]
[null,null,"+14.0%",1.1400000000000055]
[null,null,"+13.5%",1.1350000000000056]
[null,null,"+13.0%",1.1300000000000057]
[null,null,"+12.5%",1.1250000000000058]
[null,null,"+12.0%",1.1200000000000059]
[null,null,"+11.5%",1.115000000000006]
[null,null,"+11.0%",1.1100000000000061]
[null,null,"+10.5%",1.1050000000000062]
[null,null,"+10.0%",1.1000000000000063]
[null,null,"+9.5%",1.0950000000000064]
[null,null,"+9.0%",1.0900000000000065]
[null,null,"+8.5%",1.0850000000000066]
[null,null,"+8.0%",1.0800000000000067]
[null,null,"+7.5%",1.0750000000000068]
[null,null,"+7.0%",1.0700000000000069]
[null,null,"+6.5%",1.0650000000000071]
[null,null,"+6.0%",1.0600000000000072]
[null,null,"+5.5%",1.0550000000000073]
[null,null,"+5.0%",1.0500000000000074]
[null,null,"+4.5%",1.0450000000000075]
[null,null,"+4.0%",1.0400000000000076]
[null,null,"+3.5%",1.0350000000000077]
[null,null,"+3.0%",1.0300000000000078]
[null,null,"+2.5%",1.0250000000000079]
[null,null,"+2.0%",1.020000000000008]
[null,null,"+1.5%",1.0150000000000081]
[null,null,"+1.0%",1.0100000000000082]
[null,null,"+0.5%",1.0050000000000083]
[null,null,"+0.0%",1.0000000000000084]
[null,null,"-0.5%",0.99500000000000843]
[null,null,"-1.0%",0.99000000000000843]
[null,null,"-1.5%",0.98500000000000842]
[null,null,"-2.0%",0.98000000000000842]
[null,null,"-2.5%",0.97500000000000842]
[null,null,"-3.0%",0.97000000000000841]
[null,null,"-3.5%",0.96500000000000841]
[null,null,"-4.0%",0.9600000000000084]
[null,null,"-4.5%",0.9550000000000084]
[null,null,"-5.0%",0.95000000000000839]
[null,null,"-5.5%",0.94500000000000839]
[null,null,"-6.0%",0.94000000000000838]
[null,null,"-6.5%",0.93500000000000838]
[null,null,"-7.0%",0.93000000000000838]
[null,null,"-7.5%",0.92500000000000837]
[null,null,"-8.0%",0.92000000000000837]
[null,null,"-8.5%",0.91500000000000836]
[null,null,"-9.0%",0.91000000000000836]
[null,null,"-9.5%",0.90500000000000835]
[null,null,"-10.0%",0.90000000000000835]
[null,null,"-10.5%",0.89500000000000834]
[null,null,"-11.0%",0.89000000000000834]
[null,null,"-11.5%",0.88500000000000834]
[null,null,"-12.0%",0.88000000000000833]
[null,null,"-12.5%",0.87500000000000833]
[null,null,"-13.0%",0.87000000000000832]
[null,null,"-13.5%",0.86500000000000832]
[null,null,"-14.0%",0.86000000000000831]
[null,null,"-14.5%",0.85500000000000831]
[null,null,"-15.0%",0.8500000000000083]
[null,null,"-15.5%",0.8450000000000083]
[null,null,"-16.0%",0.8400000000000083]
[null,null,"-16.5%",0.83500000000000829]
[null,null,"-17.0%",0.83000000000000829]
[null,null,"-17.5%",0.82500000000000828]
[null,null,"-18.0%",0.82000000000000828]
[null,null,"-18.5%",0.81500000000000827]
[null,null,"-19.0%",0.81000000000000827]
[null,null,"-19.5%",0.80500000000000826]
[null,null,"-20.0%",0.80000000000000826]
[null,null,"-20.5%",0.79500000000000826]
[null,null,"-21.0%",0.79000000000000825]
[null,null,"-21.5%",0.78500000000000825]
[null,null,"-22.0%",0.78000000000000824]
[null,null,"-22.5%",0.77500000000000824]
[null,null,"-23.0%",0.77000000000000823]
[null,null,"-23.5%",0.76500000000000823]
[null,null,"-24.0%",0.76000000000000822]
[null,null,"-24.5%",0.75500000000000822]
[null,null,"-25.0%",0.75000000000000822]
[null,null,"-25.5%",0.74500000000000821]
[null,null,"-26.0%",0.74000000000000821]
[null,null,"-26.5%",0.7350000000000082]
[null,null,"-27.0%",0.7300000000000082]
[null,null,"-27.5%",0.72500000000000819]
[null,null,"-28.0%",0.72000000000000819]
[null,null,"-28.5%",0.71500000000000818]
[null,null,"-29.0%",0.71000000000000818]
[null,null,"-29.5%",0.70500000000000818]
[null,null,"-30.0%",0.70000000000000817]
[null,null,"-30.5%",0.69500000000000817]
[null,null,"-31.0%",0.69000000000000816]
[null,null,"-31.5%",0.68500000000000816]
[null,null,"-32.0%",0.68000000000000815]
[null,null,"-32.5%",0.67500000000000815]
[null,null,"-33.0%",0.67000000000000814]
[null,null,"-33.5%",0.66500000000000814]
[null,null,"-34.0%",0.66000000000000814]
[null,null,"-34.5%",0.65500000000000813]
[null,null,"-35.0%",0.65000000000000813]
[null,null,"-35.5%",0.64500000000000812]
[null,null,"-36.0%",0.64000000000000812]
[null,null,"-36.5%",0.63500000000000811]
[null,null,"-37.0%",0.63000000000000811]
[null,null,"-37.5%",0.6250000000000081]
[null,null,"-38.0%",0.6200000000000081]
[null,null,"-38.5%",0.6150000000000081]
[null,null,"-39.0%",0.61000000000000809]
[null,null,"-39.5%",0.60500000000000809]
[null,null,"-40.0%",0.60000000000000808]

{"sheet":"Turnaround Times","index":8,"n_rows":20,"n_cols":3,"rows_kept":20,"cut":false,"hidden":false,"merged":[[1,1,1,2],[2,1,2,2],[4,1,4,2],[5,1,5,2],[7,1,7,2]]}
[]
[null,{"$f":"'General Information'!B2:C2","v":"TBP Laboratory Benchmarking Questionnaire - Clinical Biochemistry"}]
[null,"Turnaround Times"]
[]
[null,"Please use data taken from 1st January 2020 to 31st March 2020."]
[null,"The following questions relate to the turnaroud times section of the Royal College of Pathologists KPI document."]
[null,"These inform CPA standard G1 and ISO15189:2012 standards 4.4.1 and 4.14.1.  The percentage of specified investigations from A&E completed within one hour of sample collection should be recorded and published, however not all laboratories are able to access data relating to sample collection.  We have therefore used two 'start points' in the following questions, and request that participants complete both where possible.   For clarification, we define the end point as \"the authorised result being made available to the requestor\"."]
[null,"For reference, the target set by the RCPath (for \"vein to result\") is 90% within 60 minutes."]
[]
[null,"A&E Requests for U&E (or equivalent)"]
[null,"Proportion of requests reported within one hour of sample collection (if known)",0]
[null,"Proportion of requests reported within one hour of receipt in the laboratory",0]
[null,"Average turnaround time (in minutes) (Please use 95th percentile as your average)",0]
[null,"Your local target turnaround time (in minutes)",0]
[]
[null,"A&E Requests for Troponin"]
[null,"Proportion of requests reported within one hour of sample collection (if known)",0]
[null,"Proportion of requests reported within one hour of receipt in the laboratory",0]
[null,"Average turnaround time (in minutes) (Please use 95th percentile as your average)",0]
[null,"Your local target turnaround time (in minutes)",0]

{"sheet":"Consultant Pay","index":9,"n_rows":49,"n_cols":14,"rows_kept":49,"cut":false,"hidden":true,"merged":[]}
[]
[null,null,"2003 Contract",null,null,"Pre 2003",null,null,"Clinical Excellence Awards",null,null,null,"SPR"]
[null,null,"1 (starting salary)",79860,null,"Basic",66306,null,"Level","Clinical excellence awards £",null,null,"Min",31841]
[null,null,"2 (1 year completed as consultant)",82361,null,1,71051,null,"Level 1",3016,null,null,1,33790]
[null,null,"3 (2 years completed)",84862,null,2,75796,null,"Level 2",6032,null,null,2,36511]
[null,null,"4 (3 years completed)",87362,null,3,80541,null,"Level 3",9048,null,null,3,38156]
[null,null,"5 (4-8 years completed)",89856,null,4,85951,null,"Level 4",12064,null,null,4,40141]
[null,null,"6 (9-13 years completed)",95795,null,null,null,null,"Level 5",15080,null,null,5,42126]
[null,null,"7 (14-18 years completed)",101735,null,null,null,null,"Level 6",18096,null,null,6,44112]
[null,null,"8 (19 years completed)",107668,null,null,null,null,"Level 7",24128,null,null,7,46096]
[null,null,null,null,null,null,null,null,"Level 8",30160,null,null,8,48082]
[null,null,null,null,null,null,null,null,"Level 9 or Bronze",36192,null,null,9,50068]
[null,null,null,null,null,null,null,null,"Level 10 or Silver",47582]
[null,null,"Basic Salary Data Lookup",null,null,"SpR Salary Lookup",null,null,"Level 11 or Gold",59477]
[null,null,"Default (Mid Point)",{"$f":"D20","v":89856},null,"Default (Mid Point)",{"$f":"MEDIAN(G16:G25)","v":41133.5},null,"Level 12 or Platinum",77320]
[null,null,"2003 Contract: (starting salary)",79860,null,"Min: £31,841",31841]
[null,null,"2003 Contract: (1 year completed as consultan",82361,null,"1: £33,790",33790]
[null,null,"2003 Contract: (2 years completed)",84862,null,"2: £36,511",36511]
[null,null,"2003 Contract: (3 years completed)",87362,null,"3: £38,156",38156]
[null,null,"2003 Contract: (4-8 years completed)",89856,null,"4: £40,141",40141]
[null,null,"2003 Contract: (9-13 years completed)",95795,null,"5: £42,126",42126]
[null,null,"2003 Contract: (14-18 years completed)",101735,null,"6: £44,112",44112]
[null,null,"2003 Contract: (19 years completed)",107668,null,"7: £46,096",46096]
[null,null,"Pre 2003: Basic",66306,null,"8: £48,082",48082]
[null,null,"Pre 2003: 1",71051,null,"9: £50,068",50068]
[null,null,"Pre 2003: 2",75796]
[null,null,"Pre 2003: 3",80541]
[null,null,"Pre 2003: 4",85951]
[]
[null,null,"Clinical Excellence Award Lookup",null,null,"Other Medical Staff Salary"]
[null,null,"Exclude",0,null,"Default (Mid Point)",{"$f":"MEDIAN(G32:G43)","v":35645}]
[null,null,"Default (Mid Point)",{"$f":"MEDIAN(D33:D44)","v":21112},null,"AfC1",17652]
[null,null,"Level 1",3016,null,"AfC2",17652]
[null,null,"Level 2",6032,null,"AfC3",18813]
[null,null,"Level 3",9048,null,"AfC4",21819]
[null,null,"Level 4",12064,null,"AfC5",26220]
[null,null,"Level 5",15080,null,"AfC6",32525]
[null,null,"Level 6",18096,null,"AfC7",38765]
[null,null,"Level 7",24128,null,"AfC8a",45468.5]
[null,null,"Level 8",30160,null,"AfC8b",53766]
[null,null,"Level 9 or Bronze",36192,null,"AfC8c",63223.5]
[null,null,"Level 10 or Silver",47582,null,"AfC8d",75743]
[null,null,"Level 11 or Gold",59477,null,"AfC9",91686]
[null,null,"Level 12 or Platinum",77320]
[]
[null,null,"Calculated Salary for Consultants:",{"$f":"SUM(SUM(VLOOKUP('Staffing and Finance Data Entry'!$D$15,'Consultant Pay'!$C$15:$D$28,2,FALSE),VLOOKUP('Staffing and Finance Data Entry'!$D$16,'Consultant Pay'!$C$31:$D$44,2,FALSE))*SUM(1,'Staffing and Finance Data Entry'!D9)*VLOOKUP('Staffing and Finance Data Entry'!D19,lists!C3:D400,2,FALSE))","v":139819.68000000119}]
[null,null,"Locum Salary",{"$f":"SUM(D22*SUM(1,'Staffing and Finance Data Entry'!D9)*SUM(1,'Staffing and Finance Data Entry'!D19)*VLOOKUP('Staffing and Finance Data Entry'!D19,lists!C3:D400,2,FALSE))","v":128186.10000000108}]
[null,null,"SpR Salary",{"$f":"SUM(VLOOKUP('Staffing and Finance Data Entry'!D17,'Consultant Pay'!F15:G25,2,FALSE)*SUM(1,'Staffing and Finance Data Entry'!D9)*SUM(1,'Staffing and Finance Data Entry'!D19)*VLOOKUP('Staffing and Finance Data Entry'!D19,lists!C3:D400,2,FALSE))","v":51828.210000000436}]
[null,null,"Other Medical Staff Salary",{"$f":"SUM(VLOOKUP('Staffing and Finance Data Entry'!D18,'Consultant Pay'!F31:G43,2,FALSE)*SUM(1,'Staffing and Finance Data Entry'!D9)*SUM(1,'Staffing and Finance Data Entry'!D19)*VLOOKUP('Staffing and Finance Data Entry'!D19,lists!C3:D400,2,FALSE))","v":44912.700000000375}]

{"sheet":"Data Export","index":10,"n_rows":2264,"n_cols":9,"rows_kept":2264,"cut":false,"hidden":true,"merged":[]}
[]
[null,null,null,null,"Selected Disc Code:","CH"]
[null,null,null,null,null,null,null,null,"Selected Lab"]
[null,null,"Import Number","AfC Import","Raw Code","Salary Calc","Final Code","Descriptor","E000"]
[null,null,null,null,null,null,null,"LOOKUP",4]
[null,null,1,4,"Staffing-Total-Q1",null,{"$f":"CONCATENATE($F$2,\"-\",E6)","v":"CH-Staffing-Total-Q1"},"Total FTE - Medical Consultant",{"$f":"IF(ISERROR(VLOOKUP($C6,'Staffing and Finance Data Entry'!$A$30:$P$60,$D6,FALSE))=TRUE,\"XXX\",IF(VLOOKUP($C6,'Staffing and Finance Data Entry'!$A$30:$P$60,$D6,FALSE)=0,\"XXX\",VLOOKUP($C6,'Staffing and Finance Data Entry'!$A$30:$P$60,$D6,FALSE)))","v":"XXX"}]
[null,null,2,4,"Staffing-Total-Q2",null,{"$f":"CONCATENATE($F$2,\"-\",E7)","v":"CH-Staffing-Total-Q2"},"Total FTE - Locum Consultants",{"$f":"IF(ISERROR(VLOOKUP($C7,'Staffing and Finance Data Entry'!$A$30:$P$60,$D7,FALSE))=TRUE,\"XXX\",IF(VLOOKUP($C7,'Staffing and Finance Data Entry'!$A$30:$P$60,$D7,FALSE)=0,\"XXX\",VLOOKUP($C7,'Staffing and Finance Data Entry'!$A$30:$P$60,$D7,FALSE)))","v":"XXX"}]
[null,null,3,4,"Staffing-Total-Q3",null,"CH-Staffing-Total-Q3","Total FTE - Junior Doctors/Specialty Trainees (Specialist Registrar/SpR) - Internally Funded",{"$f":"IF(ISERROR(VLOOKUP($C8,'Staffing and Finance Data Entry'!$A$30:$P$60,$D8,FALSE))=TRUE,\"XXX\",IF(VLOOKUP($C8,'Staffing and Finance Data Entry'!$A$30:$P$60,$D8,FALSE)=0,\"XXX\",SUM(VLOOKUP($C8,'Staffing and Finance Data Entry'!$A$30:$P$60,$D8,FALSE)*'Staffing and Finance Data Entry'!$D$22)))","v":"XXX"}]
[null,null,4,4,"Staffing-Total-Q4",null,"CH-Staffing-Total-Q4","Total FTE - Junior Doctors/Specialty Trainees (Specialist Registrar/SpR) - Externally Funded",{"$f":"IF(ISERROR(VLOOKUP($C9,'Staffing and Finance Data Entry'!$A$30:$P$60,$D9,FALSE))=TRUE,\"XXX\",IF(VLOOKUP($C9,'Staffing and Finance Data Entry'!$A$30:$P$60,$D9,FALSE)=0,\"XXX\",SUM(VLOOKUP($C9,'Staffing and Finance Data Entry'!$A$30:$P$60,$D9,FALSE)*'Staffing and Finance Data Entry'!$D$22)))","v":"XXX"}]
[null,null,5,4,"Staffing-Total-Q6",null,"CH-Staffing-Total-Q6","Total FTE - Remaining Other Medical Staff",{"$f":"IF(ISERROR(VLOOKUP($C10,'Staffing and Finance Data Entry'!$A$30:$P$60,$D10,FALSE))=TRUE,\"XXX\",IF(VLOOKUP($C10,'Staffing and Finance Data Entry'!$A$30:$P$60,$D10,FALSE)=0,\"XXX\",VLOOKUP($C10,'Staffing and Finance Data Entry'!$A$30:$P$60,$D10,FALSE)))","v":"XXX"}]
[null,null,6,4,"Staffing-Total-Q8",null,"CH-Staffing-Total-Q8","Total FTE - Consultant Clinical Scientist",{"$f":"IF(ISERROR(VLOOKUP($C11,'Staffing and Finance Data Entry'!$A$30:$P$60,$D11,FALSE))=TRUE,\"XXX\",IF(VLOOKUP($C11,'Staffing and Finance Data Entry'!$A$30:$P$60,$D11,FALSE)=0,\"XXX\",VLOOKUP($C11,'Staffing and Finance Data Entry'!$A$30:$P$60,$D11,FALSE)))","v":"XXX"}]
[null,null,7,4,"Staffing-Total-Q9",null,"CH-Staffing-Total-Q9","Total FTE - Non-Trainee, Non-Consultant Clinical Scientist",{"$f":"IF(ISERROR(VLOOKUP($C12,'Staffing and Finance Data Entry'!$A$30:$P$60,$D12,FALSE))=TRUE,\"XXX\",IF(VLOOKUP($C12,'Staffing and Finance Data Entry'!$A$30:$P$60,$D12,FALSE)=0,\"XXX\",VLOOKUP($C12,'Staffing and Finance Data Entry'!$A$30:$P$60,$D12,FALSE)))","v":"XXX"}]
[null,null,8,4,"Staffing-Total-Q10",null,"CH-Staffing-Total-Q10","Total FTE - Trainee Clinical Scientist (eg STP) - Internally Funded",{"$f":"IF(ISERROR(VLOOKUP($C13,'Staffing and Finance Data Entry'!$A$30:$P$60,$D13,FALSE))=TRUE,\"XXX\",IF(VLOOKUP($C13,'Staffing and Finance Data Entry'!$A$30:$P$60,$D13,FALSE)=0,\"XXX\",SUM(VLOOKUP($C13,'Staffing and Finance Data Entry'!$A$30:$P$60,$D13,FALSE)*'Staffing and Finance Data Entry'!$D$23)))","v":"XXX"}]
[null,null,9,4,"Staffing-Total-Q11",null,"CH-Staffing-Total-Q11","Total FTE - Trainee Clinical Scientist (eg STP) - Externally Funded",{"$f":"IF(ISERROR(VLOOKUP($C14,'Staffing and Finance Data Entry'!$A$30:$P$60,$D14,FALSE))=TRUE,\"XXX\",IF(VLOOKUP($C14,'Staffing and Finance Data Entry'!$A$30:$P$60,$D14,FALSE)=0,\"XXX\",SUM(VLOOKUP($C14,'Staffing and Finance Data Entry'!$A$30:$P$60,$D14,FALSE)*'Staffing and Finance Data Entry'!$D$23)))","v":"XXX"}]
[null,null,null,4,"Staffing-Total-Q13",null,"CH-Staffing-Total-Q13","Total FTE - Consultant Biomedical Scientist",{"$f":"IF(ISERROR(VLOOKUP($C15,'Staffing and Finance Data Entry'!$A$30:$P$60,$D15,FALSE))=TRUE,\"XXX\",IF(VLOOKUP($C15,'Staffing and Finance Data Entry'!$A$30:$P$60,$D15,FALSE)=0,\"XXX\",VLOOKUP($C15,'Staffing and Finance Data Entry'!$A$30:$P$60,$D15,FALSE)))","v":"XXX"}]
[null,null,10,4,"Staffing-Total-Q14",null,"CH-Staffing-Total-Q14","Total FTE - Non Trainee Biomedical Scientist",{"$f":"IF(ISERROR(VLOOKUP($C16,'Staffing and Finance Data Entry'!$A$30:$P$60,$D16,FALSE))=TRUE,\"XXX\",IF(VLOOKUP($C16,'Staffing and Finance Data Entry'!$A$30:$P$60,$D16,FALSE)=0,\"XXX\",VLOOKUP($C16,'Staffing and Finance Data Entry'!$A$30:$P$60,$D16,FALSE)))","v":"XXX"}]
[null,null,11,4,"Staffing-Total-Q15",null,"CH-Staffing-Total-Q15","Total FTE - Trainee Biomedical Scientist - Internally Funded",{"$f":"IF(ISERROR(VLOOKUP($C17,'Staffing and Finance Data Entry'!$A$30:$P$60,$D17,FALSE))=TRUE,\"XXX\",IF(VLOOKUP($C17,'Staffing and Finance Data Entry'!$A$30:$P$60,$D17,FALSE)=0,\"XXX\",SUM(VLOOKUP($C17,'Staffing and Finance Data Entry'!$A$30:$P$60,$D17,FALSE)*'Staffing and Finance Data Entry'!$D$24)))","v":"XXX"}]
[null,null,12,4,"Staffing-Total-Q16",null,"CH-Staffing-Total-Q16","Total FTE - Trainee Biomedical Scientist - Externally Funded",{"$f":"IF(ISERROR(VLOOKUP($C18,'Staffing and Finance Data Entry'!$A$30:$P$60,$D18,FALSE))=TRUE,\"XXX\",IF(VLOOKUP($C18,'Staffing and Finance Data Entry'!$A$30:$P$60,$D18,FALSE)=0,\"XXX\",SUM(VLOOKUP($C18,'Staffing and Finance Data Entry'!$A$30:$P$60,$D18,FALSE)*'Staffing and Finance Data Entry'!$D$24)))","v":"XXX"}]
[null,null,13,4,"Staffing-Total-Q18",null,"CH-Staffing-Total-Q18","Total FTE - Laboratory Support Worker/Medical Laboratory Assistant (MLA)",{"$f":"IF(ISERROR(VLOOKUP($C19,'Staffing and Finance Data Entry'!$A$30:$P$60,$D19,FALSE))=TRUE,\"XXX\",IF(VLOOKUP($C19,'Staffing and Finance Data Entry'!$A$30:$P$60,$D19,FALSE)=0,\"XXX\",VLOOKUP($C19,'Staffing and Finance Data Entry'!$A$30:$P$60,$D19,FALSE)))","v":"XXX"}]
[null,null,14,4,"Staffing-Total-Q19",null,"CH-Staffing-Total-Q19","Total FTE - Associate Practitioner",{"$f":"IF(ISERROR(VLOOKUP($C20,'Staffing and Finance Data Entry'!$A$30:$P$60,$D20,FALSE))=TRUE,\"XXX\",IF(VLOOKUP($C20,'Staffing and Finance Data Entry'!$A$30:$P$60,$D20,FALSE)=0,\"XXX\",VLOOKUP($C20,'Staffing and Finance Data Entry'!$A$30:$P$60,$D20,FALSE)))","v":"XXX"}]
[null,null,15,4,"Staffing-Total-Q28",null,"CH-Staffing-Total-Q28","Total FTE - Cytoscreeners",{"$f":"IF(ISERROR(VLOOKUP($C21,'Staffing and Finance Data Entry'!$A$30:$P$60,$D21,FALSE))=TRUE,\"XXX\",IF(VLOOKUP($C21,'Staffing and Finance Data Entry'!$A$30:$P$60,$D21,FALSE)=0,\"XXX\",VLOOKUP($C21,'Staffing and Finance Data Entry'!$A$30:$P$60,$D21,FALSE)))","v":"XXX"}]
[null,null,16,4,"Staffing-Total-Q21",null,"CH-Staffing-Total-Q21","Total FTE - Administrative and Clerical Staff",{"$f":"IF(ISERROR(VLOOKUP($C22,'Staffing and Finance Data Entry'!$A$30:$P$60,$D22,FALSE))=TRUE,\"XXX\",IF(VLOOKUP($C22,'Staffing and Finance Data Entry'!$A$30:$P$60,$D22,FALSE)=0,\"XXX\",VLOOKUP($C22,'Staffing and Finance Data Entry'!$A$30:$P$60,$D22,FALSE)))","v":"XXX"}]
[null,null,17,4,"Staffing-Total-Q22",null,"CH-Staffing-Total-Q22","Total FTE - Management Staff (Include Clinical Director, Finance Director, Lab Manager etc)",{"$f":"IF(ISERROR(VLOOKUP($C23,'Staffing and Finance Data Entry'!$A$30:$P$60,$D23,FALSE))=TRUE,\"XXX\",IF(VLOOKUP($C23,'Staffing and Finance Data Entry'!$A$30:$P$60,$D23,FALSE)=0,\"XXX\",VLOOKUP($C23,'Staffing and Finance Data Entry'!$A$30:$P$60,$D23,FALSE)))","v":"XXX"}]
[null,null,18,4,"Staffing-Total-Q23",null,"CH-Staffing-Total-Q23","Total FTE - Quality Managers",{"$f":"IF(ISERROR(VLOOKUP($C24,'Staffing and Finance Data Entry'!$A$30:$P$60,$D24,FALSE))=TRUE,\"XXX\",IF(VLOOKUP($C24,'Staffing and Finance Data Entry'!$A$30:$P$60,$D24,FALSE)=0,\"XXX\",VLOOKUP($C24,'Staffing and Finance Data Entry'!$A$30:$P$60,$D24,FALSE)))","v":"XXX"}]
[null,null,19,4,"Staffing-Total-Q24",null,"CH-Staffing-Total-Q24","Total FTE - IT Staff",{"$f":"IF(ISERROR(VLOOKUP($C25,'Staffing and Finance Data Entry'!$A$30:$P$60,$D25,FALSE))=TRUE,\"XXX\",IF(VLOOKUP($C25,'Staffing and Finance Data Entry'!$A$30:$P$60,$D25,FALSE)=0,\"XXX\",VLOOKUP($C25,'Staffing and Finance Data Entry'!$A$30:$P$60,$D25,FALSE)))","v":"XXX"}]
[null,null,20,4,"Staffing-Total-Q25",null,"CH-Staffing-Total-Q25","Total FTE - Remaning Other Staff",{"$f":"IF(ISERROR(VLOOKUP($C26,'Staffing and Finance Data Entry'!$A$30:$P$60,$D26,FALSE))=TRUE,\"XXX\",IF(VLOOKUP($C26,'Staffing and Finance Data Entry'!$A$30:$P$60,$D26,FALSE)=0,\"XXX\",VLOOKUP($C26,'Staffing and Finance Data Entry'!$A$30:$P$60,$D26,FALSE)))","v":"XXX"}]
[null,null,21,4,"Staffing-Total-Q27",null,"CH-Staffing-Total-Q27","Total FTE - Total",{"$f":"IF(SUM(I6:I26)=0,\"XXX\",SUM(I6:I26))","v":"XXX"}]
[null,null,6,5,"Staffing-AfC1-Q1",null,"CH-Staffing-AfC1-Q1","AfC 1 - Consultant Clinical Scientist",{"$f":"IF(ISERROR(VLOOKUP($C28,'Staffing and Finance Data Entry'!$A$30:$P$60,$D28,FALSE))=TRUE,\"XXX\",IF(VLOOKUP($C28,'Staffing and Finance Data Entry'!$A$30:$P$60,$D28,FALSE)=0,\"XXX\",VLOOKUP($C28,'Staffing and Finance Data Entry'!$A$30:$P$60,$D28,FALSE)))","v":"XXX"}]
[null,null,7,5,"Staffing-AfC1-Q2",null,"CH-Staffing-AfC1-Q2","AfC 1 - Non-Trainee, Non-Consultant Clinical Scientist",{"$f":"IF(ISERROR(VLOOKUP($C29,'Staffing and Finance Data Entry'!$A$30:$P$60,$D29,FALSE))=TRUE,\"XXX\",IF(VLOOKUP($C29,'Staffing and Finance Data Entry'!$A$30:$P$60,$D29,FALSE)=0,\"XXX\",VLOOKUP($C29,'Staffing and Finance Data Entry'!$A$30:$P$60,$D29,FALSE)))","v":"XXX"}]
[null,null,8,5,"Staffing-AfC1-Q3",null,"CH-Staffing-AfC1-Q3","AfC 1 - Trainee Clinical Scientist (eg STP) - Internally Funded",{"$f":"IF(ISERROR(VLOOKUP($C30,'Staffing and Finance Data Entry'!$A$30:$P$60,$D30,FALSE))=TRUE,\"XXX\",IF(VLOOKUP($C30,'Staffing and Finance Data Entry'!$A$30:$P$60,$D30,FALSE)=0,\"XXX\",SUM(VLOOKUP($C30,'Staffing and Finance Data Entry'!$A$30:$P$60,$D30,FALSE)*'Staffing and Finance Data Entry'!$D$23)))","v":"XXX"}]
[null,null,9,5,"Staffing-AfC1-Q4",null,"CH-Staffing-AfC1-Q4","AfC 1 - Trainee Clinical Scientist (eg STP) - Externally Funded",{"$f":"IF(ISERROR(VLOOKUP($C31,'Staffing and Finance Data Entry'!$A$30:$P$60,$D31,FALSE))=TRUE,\"XXX\",IF(VLOOKUP($C31,'Staffing and Finance Data Entry'!$A$30:$P$60,$D31,FALSE)=0,\"XXX\",SUM(VLOOKUP($C31,'Staffing and Finance Data Entry'!$A$30:$P$60,$D31,FALSE)*'Staffing and Finance Data Entry'!$D$23)))","v":"XXX"}]
[null,null,null,5,"Staffing-AfC1-Q6",null,"CH-Staffing-AfC1-Q6","AfC 1 - Consultant Biomedical Scientist",{"$f":"IF(ISERROR(VLOOKUP($C32,'Staffing and Finance Data Entry'!$A$30:$P$60,$D32,FALSE))=TRUE,\"XXX\",IF(VLOOKUP($C32,'Staffing and Finance Data Entry'!$A$30:$P$60,$D32,FALSE)=0,\"XXX\",VLOOKUP($C32,'Staffing and Finance Data Entry'!$A$30:$P$60,$D32,FALSE)))","v":"XXX"}]
[null,null,10,5,"Staffing-AfC1-Q7",null,"CH-Staffing-AfC1-Q7","AfC 1 - Non Trainee Biomedical Scientist",{"$f":"IF(ISERROR(VLOOKUP($C33,'Staffing and Finance Data Entry'!$A$30:$P$60,$D33,FALSE))=TRUE,\"XXX\",IF(VLOOKUP($C33,'Staffing and Finance Data Entry'!$A$30:$P$60,$D33,FALSE)=0,\"XXX\",VLOOKUP($C33,'Staffing and Finance Data Entry'!$A$30:$P$60,$D33,FALSE)))","v":"XXX"}]
[null,null,11,5,"Staffing-AfC1-Q8",null,"CH-Staffing-AfC1-Q8","AfC 1 - Trainee Biomedical Scientist - Internally Funded",{"$f":"IF(ISERROR(VLOOKUP($C34,'Staffing and Finance Data Entry'!$A$30:$P$60,$D34,FALSE))=TRUE,\"XXX\",IF(VLOOKUP($C34,'Staffing and Finance Data Entry'!$A$30:$P$60,$D34,FALSE)=0,\"XXX\",SUM(VLOOKUP($C34,'Staffing and Finance Data Entry'!$A$30:$P$60,$D34,FALSE)*'Staffing and Finance Data Entry'!$D$24)))","v":"XXX"}]
[null,null,12,5,"Staffing-AfC1-Q9",null,"CH-Staffing-AfC1-Q9","AfC 1 - Trainee Biomedical Scientist - Externally Funded",{"$f":"IF(ISERROR(VLOOKUP($C35,'Staffing and Finance Data Entry'!$A$30:$P$60,$D35,FALSE))=TRUE,\"XXX\",IF(VLOOKUP($C35,'Staffing and Finance Data Entry'!$A$30:$P$60,$D35,FALSE)=0,\"XXX\",SUM(VLOOKUP($C35,'Staffing and Finance Data Entry'!$A$30:$P$60,$D35,FALSE)*'Staffing and Finance Data Entry'!$D$24)))","v":"XXX"}]
[null,null,13,5,"Staffing-AfC1-Q11",null,"CH-Staffing-AfC1-Q11","AfC 1 - Laboratory Support Worker/Medical Laboratory Assistant (MLA)",{"$f":"IF(ISERROR(VLOOKUP($C36,'Staffing and Finance Data Entry'!$A$30:$P$60,$D36,FALSE))=TRUE,\"XXX\",IF(VLOOKUP($C36,'Staffing and Finance Data Entry'!$A$30:$P$60,$D36,FALSE)=0,\"XXX\",VLOOKUP($C36,'Staffing and Finance Data Entry'!$A$30:$P$60,$D36,FALSE)))","v":"XXX"}]
[null,null,14,5,"Staffing-AfC1-Q12",null,"CH-Staffing-AfC1-Q12","AfC 1 - Associate Practitioner",{"$f":"IF(ISERROR(VLOOKUP($C37,'Staffing and Finance Data Entry'!$A$30:$P$60,$D37,FALSE))=TRUE,\"XXX\",IF(VLOOKUP($C37,'Staffing and Finance Data Entry'!$A$30:$P$60,$D37,FALSE)=0,\"XXX\",VLOOKUP($C37,'Staffing and Finance Data Entry'!$A$30:$P$60,$D37,FALSE)))","v":"XXX"}]
[null,null,15,5,"Staffing-AfC1-Q28",null,"CH-Staffing-AfC1-Q28","AfC 1 - Cytoscreeners",{"$f":"IF(ISERROR(VLOOKUP($C38,'Staffing and Finance Data Entry'!$A$30:$P$60,$D38,FALSE))=TRUE,\"XXX\",IF(VLOOKUP($C38,'Staffing and Finance Data Entry'!$A$30:$P$60,$D38,FALSE)=0,\"XXX\",VLOOKUP($C38,'Staffing and Finance Data Entry'!$A$30:$P$60,$D38,FALSE)))","v":"XXX"}]
[null,null,16,5,"Staffing-AfC1-Q14",null,"CH-Staffing-AfC1-Q14","AfC 1 - Administrative and Clerical Staff",{"$f":"IF(ISERROR(VLOOKUP($C39,'Staffing and Finance Data Entry'!$A$30:$P$60,$D39,FALSE))=TRUE,\"XXX\",IF(VLOOKUP($C39,'Staffing and Finance Data Entry'!$A$30:$P$60,$D39,FALSE)=0,\"XXX\",VLOOKUP($C39,'Staffing and Finance Data Entry'!$A$30:$P$60,$D39,FALSE)))","v":"XXX"}]
[null,null,17,5,"Staffing-AfC1-Q15",null,"CH-Staffing-AfC1-Q15","AfC 1 - Management Staff (Include Clinical Director, Finance Director, Lab Manager etc)",{"$f":"IF(ISERROR(VLOOKUP($C40,'Staffing and Finance Data Entry'!$A$30:$P$60,$D40,FALSE))=TRUE,\"XXX\",IF(VLOOKUP($C40,'Staffing and Finance Data Entry'!$A$30:$P$60,$D40,FALSE)=0,\"XXX\",VLOOKUP($C40,'Staffing and Finance Data Entry'!$A$30:$P$60,$D40,FALSE)))","v":"XXX"}]
[null,null,18,5,"Staffing-AfC1-Q16",null,"CH-Staffing-AfC1-Q16","AfC 1 - Quality Managers",{"$f":"IF(ISERROR(VLOOKUP($C41,'Staffing and Finance Data Entry'!$A$30:$P$60,$D41,FALSE))=TRUE,\"XXX\",IF(VLOOKUP($C41,'Staffing and Finance Data Entry'!$A$30:$P$60,$D41,FALSE)=0,\"XXX\",VLOOKUP($C41,'Staffing and Finance Data Entry'!$A$30:$P$60,$D41,FALSE)))","v":"XXX"}]
[null,null,19,5,"Staffing-AfC1-Q17",null,"CH-Staffing-AfC1-Q17","AfC 1 - IT Staff",{"$f":"IF(ISERROR(VLOOKUP($C42,'Staffing and Finance Data Entry'!$A$30:$P$60,$D42,FALSE))=TRUE,\"XXX\",IF(VLOOKUP($C42,'Staffing and Finance Data Entry'!$A$30:$P$60,$D42,FALSE)=0,\"XXX\",VLOOKUP($C42,'Staffing and Finance Data Entry'!$A$30:$P$60,$D42,FALSE)))","v":"XXX"}]
[null,null,20,5,"Staffing-AfC1-Q18",null,"CH-Staffing-AfC1-Q18","AfC 1 - Remaning Other Staff",{"$f":"IF(ISERROR(VLOOKUP($C43,'Staffing and Finance Data Entry'!$A$30:$P$60,$D43,FALSE))=TRUE,\"XXX\",IF(VLOOKUP($C43,'Staffing and Finance Data Entry'!$A$30:$P$60,$D43,FALSE)=0,\"XXX\",VLOOKUP($C43,'Staffing and Finance Data Entry'!$A$30:$P$60,$D43,FALSE)))","v":"XXX"}]
[null,null,21,5,"Staffing-AfC1-Q20",null,"CH-Staffing-AfC1-Q20","AfC 1 - Total",{"$f":"IF(SUM(I28:I43)=0,\"XXX\",SUM(I28:I43))","v":"XXX"}]
[null,null,6,6,"Staffing-AfC2-Q1",null,"CH-Staffing-AfC2-Q1","AfC 2 - Consultant Clinical Scientist",{"$f":"IF(ISERROR(VLOOKUP($C45,'Staffing and Finance Data Entry'!$A$30:$P$60,$D45,FALSE))=TRUE,\"XXX\",IF(VLOOKUP($C45,'Staffing and Finance Data Entry'!$A$30:$P$60,$D45,FALSE)=0,\"XXX\",VLOOKUP($C45,'Staffing and Finance Data Entry'!$A$30:$P$60,$D45,FALSE)))","v":"XXX"}]
[null,null,7,6,"Staffing-AfC2-Q2",null,"CH-Staffing-AfC2-Q2","AfC 2 - Non-Trainee, Non-Consultant Clinical Scientist",{"$f":"IF(ISERROR(VLOOKUP($C46,'Staffing and Finance Data Entry'!$A$30:$P$60,$D46,FALSE))=TRUE,\"XXX\",IF(VLOOKUP($C46,'Staffing and Finance Data Entry'!$A$30:$P$60,$D46,FALSE)=0,\"XXX\",VLOOKUP($C46,'Staffing and Finance Data Entry'!$A$30:$P$60,$D46,FALSE)))","v":"XXX"}]
[null,null,8,6,"Staffing-AfC2-Q3",null,"CH-Staffing-AfC2-Q3","AfC 2 - Trainee Clinical Scientist (eg STP) - Internally Funded",{"$f":"IF(ISERROR(VLOOKUP($C47,'Staffing and Finance Data Entry'!$A$30:$P$60,$D47,FALSE))=TRUE,\"XXX\",IF(VLOOKUP($C47,'Staffing and Finance Data Entry'!$A$30:$P$60,$D47,FALSE)=0,\"XXX\",SUM(VLOOKUP($C47,'Staffing and Finance Data Entry'!$A$30:$P$60,$D47,FALSE)*'Staffing and Finance Data Entry'!$D$23)))","v":"XXX"}]
[null,null,9,6,"Staffing-AfC2-Q4",null,"CH-Staffing-AfC2-Q4","AfC 2 - Trainee Clinical Scientist (eg STP) - Externally Funded",{"$f":"IF(ISERROR(VLOOKUP($C48,'Staffing and Finance Data Entry'!$A$30:$P$60,$D48,FALSE))=TRUE,\"XXX\",IF(VLOOKUP($C48,'Staffing and Finance Data Entry'!$A$30:$P$60,$D48,FALSE)=0,\"XXX\",SUM(VLOOKUP($C48,'Staffing and Finance Data Entry'!$A$30:$P$60,$D48,FALSE)*'Staffing and Finance Data Entry'!$D$23)))","v":"XXX"}]
[null,null,null,6,"Staffing-AfC2-Q6",null,"CH-Staffing-AfC2-Q6","AfC 2 - Consultant Biomedical Scientist",{"$f":"IF(ISERROR(VLOOKUP($C49,'Staffing and Finance Data Entry'!$A$30:$P$60,$D49,FALSE))=TRUE,\"XXX\",IF(VLOOKUP($C49,'Staffing and Finance Data Entry'!$A$30:$P$60,$D49,FALSE)=0,\"XXX\",VLOOKUP($C49,'Staffing and Finance Data Entry'!$A$30:$P$60,$D49,FALSE)))","v":"XXX"}]
[null,null,10,6,"Staffing-AfC2-Q7",null,"CH-Staffing-AfC2-Q7","AfC 2 - Non Trainee Biomedical Scientist",{"$f":"IF(ISERROR(VLOOKUP($C50,'Staffing and Finance Data Entry'!$A$30:$P$60,$D50,FALSE))=TRUE,\"XXX\",IF(VLOOKUP($C50,'Staffing and Finance Data Entry'!$A$30:$P$60,$D50,FALSE)=0,\"XXX\",VLOOKUP($C50,'Staffing and Finance Data Entry'!$A$30:$P$60,$D50,FALSE)))","v":"XXX"}]
[null,null,11,6,"Staffing-AfC2-Q8",null,"CH-Staffing-AfC2-Q8","AfC 2 - Trainee Biomedical Scientist - Internally Funded",{"$f":"IF(ISERROR(VLOOKUP($C51,'Staffing and Finance Data Entry'!$A$30:$P$60,$D51,FALSE))=TRUE,\"XXX\",IF(VLOOKUP($C51,'Staffing and Finance Data Entry'!$A$30:$P$60,$D51,FALSE)=0,\"XXX\",SUM(VLOOKUP($C51,'Staffing and Finance Data Entry'!$A$30:$P$60,$D51,FALSE)*'Staffing and Finance Data Entry'!$D$24)))","v":"XXX"}]
[null,null,12,6,"Staffing-AfC2-Q9",null,"CH-Staffing-AfC2-Q9","AfC 2 - Trainee Biomedical Scientist - Externally Funded",{"$f":"IF(ISERROR(VLOOKUP($C52,'Staffing and Finance Data Entry'!$A$30:$P$60,$D52,FALSE))=TRUE,\"XXX\",IF(VLOOKUP($C52,'Staffing and Finance Data Entry'!$A$30:$P$60,$D52,FALSE)=0,\"XXX\",SUM(VLOOKUP($C52,'Staffing and Finance Data Entry'!$A$30:$P$60,$D52,FALSE)*'Staffing and Finance Data Entry'!$D$24)))","v":"XXX"}]
[null,null,13,6,"Staffing-AfC2-Q11",null,"CH-Staffing-AfC2-Q11","AfC 2 - Laboratory Support Worker/Medical Laboratory Assistant (MLA)",{"$f":"IF(ISERROR(VLOOKUP($C53,'Staffing and Finance Data Entry'!$A$30:$P$60,$D53,FALSE))=TRUE,\"XXX\",IF(VLOOKUP($C53,'Staffing and Finance Data Entry'!$A$30:$P$60,$D53,FALSE)=0,\"XXX\",VLOOKUP($C53,'Staffing and Finance Data Entry'!$A$30:$P$60,$D53,FALSE)))","v":"XXX"}]
[null,null,14,6,"Staffing-AfC2-Q12",null,"CH-Staffing-AfC2-Q12","AfC 2 - Associate Practitioner",{"$f":"IF(ISERROR(VLOOKUP($C54,'Staffing and Finance Data Entry'!$A$30:$P$60,$D54,FALSE))=TRUE,\"XXX\",IF(VLOOKUP($C54,'Staffing and Finance Data Entry'!$A$30:$P$60,$D54,FALSE)=0,\"XXX\",VLOOKUP($C54,'Staffing and Finance Data Entry'!$A$30:$P$60,$D54,FALSE)))","v":"XXX"}]
[null,null,15,6,"Staffing-AfC2-Q28",null,"CH-Staffing-AfC2-Q28","AfC 2 - Cytoscreeners",{"$f":"IF(ISERROR(VLOOKUP($C55,'Staffing and Finance Data Entry'!$A$30:$P$60,$D55,FALSE))=TRUE,\"XXX\",IF(VLOOKUP($C55,'Staffing and Finance Data Entry'!$A$30:$P$60,$D55,FALSE)=0,\"XXX\",VLOOKUP($C55,'Staffing and Finance Data Entry'!$A$30:$P$60,$D55,FALSE)))","v":"XXX"}]
[null,null,16,6,"Staffing-AfC2-Q14",null,"CH-Staffing-AfC2-Q14","AfC 2 - Administrative and Clerical Staff",{"$f":"IF(ISERROR(VLOOKUP($C56,'Staffing and Finance Data Entry'!$A$30:$P$60,$D56,FALSE))=TRUE,\"XXX\",IF(VLOOKUP($C56,'Staffing and Finance Data Entry'!$A$30:$P$60,$D56,FALSE)=0,\"XXX\",VLOOKUP($C56,'Staffing and Finance Data Entry'!$A$30:$P$60,$D56,FALSE)))","v":"XXX"}]
[null,null,17,6,"Staffing-AfC2-Q15",null,"CH-Staffing-AfC2-Q15","AfC 2 - Management Staff (Include Clinical Director, Finance Director, Lab Manager etc)",{"$f":"IF(ISERROR(VLOOKUP($C57,'Staffing and Finance Data Entry'!$A$30:$P$60,$D57,FALSE))=TRUE,\"XXX\",IF(VLOOKUP($C57,'Staffing and Finance Data Entry'!$A$30:$P$60,$D57,FALSE)=0,\"XXX\",VLOOKUP($C57,'Staffing and Finance Data Entry'!$A$30:$P$60,$D57,FALSE)))","v":"XXX"}]
[null,null,18,6,"Staffing-AfC2-Q16",null,"CH-Staffing-AfC2-Q16","AfC 2 - Quality Managers",{"$f":"IF(ISERROR(VLOOKUP($C58,'Staffing and Finance Data Entry'!$A$30:$P$60,$D58,FALSE))=TRUE,\"XXX\",IF(VLOOKUP($C58,'Staffing and Finance Data Entry'!$A$30:$P$60,$D58,FALSE)=0,\"XXX\",VLOOKUP($C58,'Staffing and Finance Data Entry'!$A$30:$P$60,$D58,FALSE)))","v":"XXX"}]
[null,null,19,6,"Staffing-AfC2-Q17",null,"CH-Staffing-AfC2-Q17","AfC 2 - IT Staff",{"$f":"IF(ISERROR(VLOOKUP($C59,'Staffing and Finance Data Entry'!$A$30:$P$60,$D59,FALSE))=TRUE,\"XXX\",IF(VLOOKUP($C59,'Staffing and Finance Data Entry'!$A$30:$P$60,$D59,FALSE)=0,\"XXX\",VLOOKUP($C59,'Staffing and Finance Data Entry'!$A$30:$P$60,$D59,FALSE)))","v":"XXX"}]
[null,null,20,6,"Staffing-AfC2-Q18",null,"CH-Staffing-AfC2-Q18","AfC 2 - Remaning Other Staff",{"$f":"IF(ISERROR(VLOOKUP($C60,'Staffing and Finance Data Entry'!$A$30:$P$60,$D60,FALSE))=TRUE,\"XXX\",IF(VLOOKUP($C60,'Staffing and Finance Data Entry'!$A$30:$P$60,$D60,FALSE)=0,\"XXX\",VLOOKUP($C60,'Staffing and Finance Data Entry'!$A$30:$P$60,$D60,FALSE)))","v":"XXX"}]
[null,null,21,6,"Staffing-AfC2-Q20",null,"CH-Staffing-AfC2-Q20","AfC 2 - Total",{"$f":"IF(SUM(I45:I60)=0,\"XXX\",SUM(I45:I60))","v":"XXX"}]
[null,null,6,7,"Staffing-AfC3-Q1",null,"CH-Staffing-AfC3-Q1","AfC 3 - Consultant Clinical Scientist",{"$f":"IF(ISERROR(VLOOKUP($C62,'Staffing and Finance Data Entry'!$A$30:$P$60,$D62,FALSE))=TRUE,\"XXX\",IF(VLOOKUP($C62,'Staffing and Finance Data Entry'!$A$30:$P$60,$D62,FALSE)=0,\"XXX\",VLOOKUP($C62,'Staffing and Finance Data Entry'!$A$30:$P$60,$D62,FALSE)))","v":"XXX"}]
[null,null,7,7,"Staffing-AfC3-Q2",null,"CH-Staffing-AfC3-Q2","AfC 3 - Non-Trainee, Non-Consultant Clinical Scientist",{"$f":"IF(ISERROR(VLOOKUP($C63,'Staffing and Finance Data Entry'!$A$30:$P$60,$D63,FALSE))=TRUE,\"XXX\",IF(VLOOKUP($C63,'Staffing and Finance Data Entry'!$A$30:$P$60,$D63,FALSE)=0,\"XXX\",VLOOKUP($C63,'Staffing and Finance Data Entry'!$A$30:$P$60,$D63,FALSE)))","v":"XXX"}]
[null,null,8,7,"Staffing-AfC3-Q3",null,"CH-Staffing-AfC3-Q3","AfC 3 - Trainee Clinical Scientist (eg STP) - Internally Funded",{"$f":"IF(ISERROR(VLOOKUP($C64,'Staffing and Finance Data Entry'!$A$30:$P$60,$D64,FALSE))=TRUE,\"XXX\",IF(VLOOKUP($C64,'Staffing and Finance Data Entry'!$A$30:$P$60,$D64,FALSE)=0,\"XXX\",SUM(VLOOKUP($C64,'Staffing and Finance Data Entry'!$A$30:$P$60,$D64,FALSE)*'Staffing and Finance Data Entry'!$D$23)))","v":"XXX"}]
[null,null,9,7,"Staffing-AfC3-Q4",null,"CH-Staffing-AfC3-Q4","AfC 3 - Trainee Clinical Scientist (eg STP) - Externally Funded",{"$f":"IF(ISERROR(VLOOKUP($C65,'Staffing and Finance Data Entry'!$A$30:$P$60,$D65,FALSE))=TRUE,\"XXX\",IF(VLOOKUP($C65,'Staffing and Finance Data Entry'!$A$30:$P$60,$D65,FALSE)=0,\"XXX\",SUM(VLOOKUP($C65,'Staffing and Finance Data Entry'!$A$30:$P$60,$D65,FALSE)*'Staffing and Finance Data Entry'!$D$23)))","v":"XXX"}]
[null,null,null,7,"Staffing-AfC3-Q6",null,"CH-Staffing-AfC3-Q6","AfC 3 - Consultant Biomedical Scientist",{"$f":"IF(ISERROR(VLOOKUP($C66,'Staffing and Finance Data Entry'!$A$30:$P$60,$D66,FALSE))=TRUE,\"XXX\",IF(VLOOKUP($C66,'Staffing and Finance Data Entry'!$A$30:$P$60,$D66,FALSE)=0,\"XXX\",VLOOKUP($C66,'Staffing and Finance Data Entry'!$A$30:$P$60,$D66,FALSE)))","v":"XXX"}]
[null,null,10,7,"Staffing-AfC3-Q7",null,"CH-Staffing-AfC3-Q7","AfC 3 - Non Trainee Biomedical Scientist",{"$f":"IF(ISERROR(VLOOKUP($C67,'Staffing and Finance Data Entry'!$A$30:$P$60,$D67,FALSE))=TRUE,\"XXX\",IF(VLOOKUP($C67,'Staffing and Finance Data Entry'!$A$30:$P$60,$D67,FALSE)=0,\"XXX\",VLOOKUP($C67,'Staffing and Finance Data Entry'!$A$30:$P$60,$D67,FALSE)))","v":"XXX"}]
[null,null,11,7,"Staffing-AfC3-Q8",null,"CH-Staffing-AfC3-Q8","AfC 3 - Trainee Biomedical Scientist - Internally Funded",{"$f":"IF(ISERROR(VLOOKUP($C68,'Staffing and Finance Data Entry'!$A$30:$P$60,$D68,FALSE))=TRUE,\"XXX\",IF(VLOOKUP($C68,'Staffing and Finance Data Entry'!$A$30:$P$60,$D68,FALSE)=0,\"XXX\",SUM(VLOOKUP($C68,'Staffing and Finance Data Entry'!$A$30:$P$60,$D68,FALSE)*'Staffing and Finance Data Entry'!$D$24)))","v":"XXX"}]
[null,null,12,7,"Staffing-AfC3-Q9",null,"CH-Staffing-AfC3-Q9","AfC 3 - Trainee Biomedical Scientist - Externally Funded",{"$f":"IF(ISERROR(VLOOKUP($C69,'Staffing and Finance Data Entry'!$A$30:$P$60,$D69,FALSE))=TRUE,\"XXX\",IF(VLOOKUP($C69,'Staffing and Finance Data Entry'!$A$30:$P$60,$D69,FALSE)=0,\"XXX\",SUM(VLOOKUP($C69,'Staffing and Finance Data Entry'!$A$30:$P$60,$D69,FALSE)*'Staffing and Finance Data Entry'!$D$24)))","v":"XXX"}]
[null,null,13,7,"Staffing-AfC3-Q11",null,"CH-Staffing-AfC3-Q11","AfC 3 - Laboratory Support Worker/Medical Laboratory Assistant (MLA)",{"$f":"IF(ISERROR(VLOOKUP($C70,'Staffing and Finance Data Entry'!$A$30:$P$60,$D70,FALSE))=TRUE,\"XXX\",IF(VLOOKUP($C70,'Staffing and Finance Data Entry'!$A$30:$P$60,$D70,FALSE)=0,\"XXX\",VLOOKUP($C70,'Staffing and Finance Data Entry'!$A$30:$P$60,$D70,FALSE)))","v":"XXX"}]
[null,null,14,7,"Staffing-AfC3-Q12",null,{"$f":"CONCATENATE($F$2,\"-\",E71)","v":"CH-Staffing-AfC3-Q12"},"AfC 3 - Associate Practitioner",{"$f":"IF(ISERROR(VLOOKUP($C71,'Staffing and Finance Data Entry'!$A$30:$P$60,$D71,FALSE))=TRUE,\"XXX\",IF(VLOOKUP($C71,'Staffing and Finance Data Entry'!$A$30:$P$60,$D71,FALSE)=0,\"XXX\",VLOOKUP($C71,'Staffing and Finance Data Entry'!$A$30:$P$60,$D71,FALSE)))","v":"XXX"}]
[null,null,15,7,"Staffing-AfC3-Q28",null,"CH-Staffing-AfC3-Q28","AfC 3 - Cytoscreeners",{"$f":"IF(ISERROR(VLOOKUP($C72,'Staffing and Finance Data Entry'!$A$30:$P$60,$D72,FALSE))=TRUE,\"XXX\",IF(VLOOKUP($C72,'Staffing and Finance Data Entry'!$A$30:$P$60,$D72,FALSE)=0,\"XXX\",VLOOKUP($C72,'Staffing and Finance Data Entry'!$A$30:$P$60,$D72,FALSE)))","v":"XXX"}]
[null,null,16,7,"Staffing-AfC3-Q14",null,"CH-Staffing-AfC3-Q14","AfC 3 - Administrative and Clerical Staff",{"$f":"IF(ISERROR(VLOOKUP($C73,'Staffing and Finance Data Entry'!$A$30:$P$60,$D73,FALSE))=TRUE,\"XXX\",IF(VLOOKUP($C73,'Staffing and Finance Data Entry'!$A$30:$P$60,$D73,FALSE)=0,\"XXX\",VLOOKUP($C73,'Staffing and Finance Data Entry'!$A$30:$P$60,$D73,FALSE)))","v":"XXX"}]
[null,null,17,7,"Staffing-AfC3-Q15",null,"CH-Staffing-AfC3-Q15","AfC 3 - Management Staff (Include Clinical Director, Finance Director, Lab Manager etc)",{"$f":"IF(ISERROR(VLOOKUP($C74,'Staffing and Finance Data Entry'!$A$30:$P$60,$D74,FALSE))=TRUE,\"XXX\",IF(VLOOKUP($C74,'Staffing and Finance Data Entry'!$A$30:$P$60,$D74,FALSE)=0,\"XXX\",VLOOKUP($C74,'Staffing and Finance Data Entry'!$A$30:$P$60,$D74,FALSE)))","v":"XXX"}]
[null,null,18,7,"Staffing-AfC3-Q16",null,"CH-Staffing-AfC3-Q16","AfC 3 - Quality Managers",{"$f":"IF(ISERROR(VLOOKUP($C75,'Staffing and Finance Data Entry'!$A$30:$P$60,$D75,FALSE))=TRUE,\"XXX\",IF(VLOOKUP($C75,'Staffing and Finance Data Entry'!$A$30:$P$60,$D75,FALSE)=0,\"XXX\",VLOOKUP($C75,'Staffing and Finance Data Entry'!$A$30:$P$60,$D75,FALSE)))","v":"XXX"}]
[null,null,19,7,"Staffing-AfC3-Q17",null,"CH-Staffing-AfC3-Q17","AfC 3 - IT Staff",{"$f":"IF(ISERROR(VLOOKUP($C76,'Staffing and Finance Data Entry'!$A$30:$P$60,$D76,FALSE))=TRUE,\"XXX\",IF(VLOOKUP($C76,'Staffing and Finance Data Entry'!$A$30:$P$60,$D76,FALSE)=0,\"XXX\",VLOOKUP($C76,'Staffing and Finance Data Entry'!$A$30:$P$60,$D76,FALSE)))","v":"XXX"}]
[null,null,20,7,"Staffing-AfC3-Q18",null,"CH-Staffing-AfC3-Q18","AfC 3 - Remaning Other Staff",{"$f":"IF(ISERROR(VLOOKUP($C77,'Staffing and Finance Data Entry'!$A$30:$P$60,$D77,FALSE))=TRUE,\"XXX\",IF(VLOOKUP($C77,'Staffing and Finance Data Entry'!$A$30:$P$60,$D77,FALSE)=0,\"XXX\",VLOOKUP($C77,'Staffing and Finance Data Entry'!$A$30:$P$60,$D77,FALSE)))","v":"XXX"}]
[null,null,21,7,"Staffing-AfC3-Q20",null,"CH-Staffing-AfC3-Q20","AfC 3 - Total",{"$f":"IF(SUM(I62:I77)=0,\"XXX\",SUM(I62:I77))","v":"XXX"}]
[null,null,6,8,"Staffing-AfC4-Q1",null,"CH-Staffing-AfC4-Q1","AfC 4 - Consultant Clinical Scientist",{"$f":"IF(ISERROR(VLOOKUP($C79,'Staffing and Finance Data Entry'!$A$30:$P$60,$D79,FALSE))=TRUE,\"XXX\",IF(VLOOKUP($C79,'Staffing and Finance Data Entry'!$A$30:$P$60,$D79,FALSE)=0,\"XXX\",VLOOKUP($C79,'Staffing and Finance Data Entry'!$A$30:$P$60,$D79,FALSE)))","v":"XXX"}]
[null,null,7,8,"Staffing-AfC4-Q2",null,"CH-Staffing-AfC4-Q2","AfC 4 - Non-Trainee, Non-Consultant Clinical Scientist",{"$f":"IF(ISERROR(VLOOKUP($C80,'Staffing and Finance Data Entry'!$A$30:$P$60,$D80,FALSE))=TRUE,\"XXX\",IF(VLOOKUP($C80,'Staffing and Finance Data Entry'!$A$30:$P$60,$D80,FALSE)=0,\"XXX\",VLOOKUP($C80,'Staffing and Finance Data Entry'!$A$30:$P$60,$D80,FALSE)))","v":"XXX"}]
[null,null,8,8,"Staffing-AfC4-Q3",null,"CH-Staffing-AfC4-Q3","AfC 4 - Trainee Clinical Scientist (eg STP) - Internally Funded",{"$f":"IF(ISERROR(VLOOKUP($C81,'Staffing and Finance Data Entry'!$A$30:$P$60,$D81,FALSE))=TRUE,\"XXX\",IF(VLOOKUP($C81,'Staffing and Finance Data Entry'!$A$30:$P$60,$D81,FALSE)=0,\"XXX\",SUM(VLOOKUP($C81,'Staffing and Finance Data Entry'!$A$30:$P$60,$D81,FALSE)*'Staffing and Finance Data Entry'!$D$23)))","v":"XXX"}]
[null,null,9,8,"Staffing-AfC4-Q4",null,"CH-Staffing-AfC4-Q4","AfC 4 - Trainee Clinical Scientist (eg STP) - Externally Funded",{"$f":"IF(ISERROR(VLOOKUP($C82,'Staffing and Finance Data Entry'!$A$30:$P$60,$D82,FALSE))=TRUE,\"XXX\",IF(VLOOKUP($C82,'Staffing and Finance Data Entry'!$A$30:$P$60,$D82,FALSE)=0,\"XXX\",SUM(VLOOKUP($C82,'Staffing and Finance Data Entry'!$A$30:$P$60,$D82,FALSE)*'Staffing and Finance Data Entry'!$D$23)))","v":"XXX"}]
[null,null,null,8,"Staffing-AfC4-Q6",null,"CH-Staffing-AfC4-Q6","AfC 4 - Consultant Biomedical Scientist",{"$f":"IF(ISERROR(VLOOKUP($C83,'Staffing and Finance Data Entry'!$A$30:$P$60,$D83,FALSE))=TRUE,\"XXX\",IF(VLOOKUP($C83,'Staffing and Finance Data Entry'!$A$30:$P$60,$D83,FALSE)=0,\"XXX\",VLOOKUP($C83,'Staffing and Finance Data Entry'!$A$30:$P$60,$D83,FALSE)))","v":"XXX"}]
[null,null,10,8,"Staffing-AfC4-Q7",null,"CH-Staffing-AfC4-Q7","AfC 4 - Non Trainee Biomedical Scientist",{"$f":"IF(ISERROR(VLOOKUP($C84,'Staffing and Finance Data Entry'!$A$30:$P$60,$D84,FALSE))=TRUE,\"XXX\",IF(VLOOKUP($C84,'Staffing and Finance Data Entry'!$A$30:$P$60,$D84,FALSE)=0,\"XXX\",VLOOKUP($C84,'Staffing and Finance Data Entry'!$A$30:$P$60,$D84,FALSE)))","v":"XXX"}]
[null,null,11,8,"Staffing-AfC4-Q8",null,"CH-Staffing-AfC4-Q8","AfC 4 - Trainee Biomedical Scientist - Internally Funded",{"$f":"IF(ISERROR(VLOOKUP($C85,'Staffing and Finance Data Entry'!$A$30:$P$60,$D85,FALSE))=TRUE,\"XXX\",IF(VLOOKUP($C85,'Staffing and Finance Data Entry'!$A$30:$P$60,$D85,FALSE)=0,\"XXX\",SUM(VLOOKUP($C85,'Staffing and Finance Data Entry'!$A$30:$P$60,$D85,FALSE)*'Staffing and Finance Data Entry'!$D$24)))","v":"XXX"}]
[null,null,12,8,"Staffing-AfC4-Q9",null,"CH-Staffing-AfC4-Q9","AfC 4 - Trainee Biomedical Scientist - Externally Funded",{"$f":"IF(ISERROR(VLOOKUP($C86,'Staffing and Finance Data Entry'!$A$30:$P$60,$D86,FALSE))=TRUE,\"XXX\",IF(VLOOKUP($C86,'Staffing and Finance Data Entry'!$A$30:$P$60,$D86,FALSE)=0,\"XXX\",SUM(VLOOKUP($C86,'Staffing and Finance Data Entry'!$A$30:$P$60,$D86,FALSE)*'Staffing and Finance Data Entry'!$D$24)))","v":"XXX"}]
[null,null,13,8,"Staffing-AfC4-Q11",null,"CH-Staffing-AfC4-Q11","AfC 4 - Laboratory Support Worker/Medical Laboratory Assistant (MLA)",{"$f":"IF(ISERROR(VLOOKUP($C87,'Staffing and Finance Data Entry'!$A$30:$P$60,$D87,FALSE))=TRUE,\"XXX\",IF(VLOOKUP($C87,'Staffing and Finance Data Entry'!$A$30:$P$60,$D87,FALSE)=0,\"XXX\",VLOOKUP($C87,'Staffing and Finance Data Entry'!$A$30:$P$60,$D87,FALSE)))","v":"XXX"}]
[null,null,14,8,"Staffing-AfC4-Q12",null,"CH-Staffing-AfC4-Q12","AfC 4 - Associate Practitioner",{"$f":"IF(ISERROR(VLOOKUP($C88,'Staffing and Finance Data Entry'!$A$30:$P$60,$D88,FALSE))=TRUE,\"XXX\",IF(VLOOKUP($C88,'Staffing and Finance Data Entry'!$A$30:$P$60,$D88,FALSE)=0,\"XXX\",VLOOKUP($C88,'Staffing and Finance Data Entry'!$A$30:$P$60,$D88,FALSE)))","v":"XXX"}]
[null,null,15,8,"Staffing-AfC4-Q28",null,"CH-Staffing-AfC4-Q28","AfC 4 - Cytoscreeners",{"$f":"IF(ISERROR(VLOOKUP($C89,'Staffing and Finance Data Entry'!$A$30:$P$60,$D89,FALSE))=TRUE,\"XXX\",IF(VLOOKUP($C89,'Staffing and Finance Data Entry'!$A$30:$P$60,$D89,FALSE)=0,\"XXX\",VLOOKUP($C89,'Staffing and Finance Data Entry'!$A$30:$P$60,$D89,FALSE)))","v":"XXX"}]
[null,null,16,8,"Staffing-AfC4-Q14",null,"CH-Staffing-AfC4-Q14","AfC 4 - Administrative and Clerical Staff",{"$f":"IF(ISERROR(VLOOKUP($C90,'Staffing and Finance Data Entry'!$A$30:$P$60,$D90,FALSE))=TRUE,\"XXX\",IF(VLOOKUP($C90,'Staffing and Finance Data Entry'!$A$30:$P$60,$D90,FALSE)=0,\"XXX\",VLOOKUP($C90,'Staffing and Finance Data Entry'!$A$30:$P$60,$D90,FALSE)))","v":"XXX"}]
[null,null,17,8,"Staffing-AfC4-Q15",null,"CH-Staffing-AfC4-Q15","AfC 4 - Management Staff (Include Clinical Director, Finance Director, Lab Manager etc)",{"$f":"IF(ISERROR(VLOOKUP($C91,'Staffing and Finance Data Entry'!$A$30:$P$60,$D91,FALSE))=TRUE,\"XXX\",IF(VLOOKUP($C91,'Staffing and Finance Data Entry'!$A$30:$P$60,$D91,FALSE)=0,\"XXX\",VLOOKUP($C91,'Staffing and Finance Data Entry'!$A$30:$P$60,$D91,FALSE)))","v":"XXX"}]
[null,null,18,8,"Staffing-AfC4-Q16",null,"CH-Staffing-AfC4-Q16","AfC 4 - Quality Managers",{"$f":"IF(ISERROR(VLOOKUP($C92,'Staffing and Finance Data Entry'!$A$30:$P$60,$D92,FALSE))=TRUE,\"XXX\",IF(VLOOKUP($C92,'Staffing and Finance Data Entry'!$A$30:$P$60,$D92,FALSE)=0,\"XXX\",VLOOKUP($C92,'Staffing and Finance Data Entry'!$A$30:$P$60,$D92,FALSE)))","v":"XXX"}]
[null,null,19,8,"Staffing-AfC4-Q17",null,"CH-Staffing-AfC4-Q17","AfC 4 - IT Staff",{"$f":"IF(ISERROR(VLOOKUP($C93,'Staffing and Finance Data Entry'!$A$30:$P$60,$D93,FALSE))=TRUE,\"XXX\",IF(VLOOKUP($C93,'Staffing and Finance Data Entry'!$A$30:$P$60,$D93,FALSE)=0,\"XXX\",VLOOKUP($C93,'Staffing and Finance Data Entry'!$A$30:$P$60,$D93,FALSE)))","v":"XXX"}]
[null,null,20,8,"Staffing-AfC4-Q18",null,"CH-Staffing-AfC4-Q18","AfC 4 - Remaning Other Staff",{"$f":"IF(ISERROR(VLOOKUP($C94,'Staffing and Finance Data Entry'!$A$30:$P$60,$D94,FALSE))=TRUE,\"XXX\",IF(VLOOKUP($C94,'Staffing and Finance Data Entry'!$A$30:$P$60,$D94,FALSE)=0,\"XXX\",VLOOKUP($C94,'Staffing and Finance Data Entry'!$A$30:$P$60,$D94,FALSE)))","v":"XXX"}]
[null,null,21,8,"Staffing-AfC4-Q20",null,"CH-Staffing-AfC4-Q20","AfC 4 - Total",{"$f":"IF(SUM(I79:I94)=0,\"XXX\",SUM(I79:I94))","v":"XXX"}]
[null,null,6,9,"Staffing-AfC5-Q1",null,"CH-Staffing-AfC5-Q1","AfC 5 - Consultant Clinical Scientist",{"$f":"IF(ISERROR(VLOOKUP($C96,'Staffing and Finance Data Entry'!$A$30:$P$60,$D96,FALSE))=TRUE,\"XXX\",IF(VLOOKUP($C96,'Staffing and Finance Data Entry'!$A$30:$P$60,$D96,FALSE)=0,\"XXX\",VLOOKUP($C96,'Staffing and Finance Data Entry'!$A$30:$P$60,$D96,FALSE)))","v":"XXX"}]
[null,null,7,9,"Staffing-AfC5-Q2",null,"CH-Staffing-AfC5-Q2","AfC 5 - Non-Trainee, Non-Consultant Clinical Scientist",{"$f":"IF(ISERROR(VLOOKUP($C97,'Staffing and Finance Data Entry'!$A$30:$P$60,$D97,FALSE))=TRUE,\"XXX\",IF(VLOOKUP($C97,'Staffing and Finance Data Entry'!$A$30:$P$60,$D97,FALSE)=0,\"XXX\",VLOOKUP($C97,'Staffing and Finance Data Entry'!$A$30:$P$60,$D97,FALSE)))","v":"XXX"}]
[null,null,8,9,"Staffing-AfC5-Q3",null,"CH-Staffing-AfC5-Q3","AfC 5 - Trainee Clinical Scientist (eg STP) - Internally Funded",{"$f":"IF(ISERROR(VLOOKUP($C98,'Staffing and Finance Data Entry'!$A$30:$P$60,$D98,FALSE))=TRUE,\"XXX\",IF(VLOOKUP($C98,'Staffing and Finance Data Entry'!$A$30:$P$60,$D98,FALSE)=0,\"XXX\",SUM(VLOOKUP($C98,'Staffing and Finance Data Entry'!$A$30:$P$60,$D98,FALSE)*'Staffing and Finance Data Entry'!$D$23)))","v":"XXX"}]
[null,null,9,9,"Staffing-AfC5-Q4",null,"CH-Staffing-AfC5-Q4","AfC 5 - Trainee Clinical Scientist (eg STP) - Externally Funded",{"$f":"IF(ISERROR(VLOOKUP($C99,'Staffing and Finance Data Entry'!$A$30:$P$60,$D99,FALSE))=TRUE,\"XXX\",IF(VLOOKUP($C99,'Staffing and Finance Data Entry'!$A$30:$P$60,$D99,FALSE)=0,\"XXX\",SUM(VLOOKUP($C99,'Staffing and Finance Data Entry'!$A$30:$P$60,$D99,FALSE)*'Staffing and Finance Data Entry'!$D$23)))","v":"XXX"}]
[null,null,null,9,"Staffing-AfC5-Q6",null,"CH-Staffing-AfC5-Q6","AfC 5 - Consultant Biomedical Scientist",{"$f":"IF(ISERROR(VLOOKUP($C100,'Staffing and Finance Data Entry'!$A$30:$P$60,$D100,FALSE))=TRUE,\"XXX\",IF(VLOOKUP($C100,'Staffing and Finance Data Entry'!$A$30:$P$60,$D100,FALSE)=0,\"XXX\",VLOOKUP($C100,'Staffing and Finance Data Entry'!$A$30:$P$60,$D100,FALSE)))","v":"XXX"}]
[null,null,10,9,"Staffing-AfC5-Q7",null,"CH-Staffing-AfC5-Q7","AfC 5 - Non Trainee Biomedical Scientist",{"$f":"IF(ISERROR(VLOOKUP($C101,'Staffing and Finance Data Entry'!$A$30:$P$60,$D101,FALSE))=TRUE,\"XXX\",IF(VLOOKUP($C101,'Staffing and Finance Data Entry'!$A$30:$P$60,$D101,FALSE)=0,\"XXX\",VLOOKUP($C101,'Staffing and Finance Data Entry'!$A$30:$P$60,$D101,FALSE)))","v":"XXX"}]
[null,null,11,9,"Staffing-AfC5-Q8",null,"CH-Staffing-AfC5-Q8","AfC 5 - Trainee Biomedical Scientist - Internally Funded",{"$f":"IF(ISERROR(VLOOKUP($C102,'Staffing and Finance Data Entry'!$A$30:$P$60,$D102,FALSE))=TRUE,\"XXX\",IF(VLOOKUP($C102,'Staffing and Finance Data Entry'!$A$30:$P$60,$D102,FALSE)=0,\"XXX\",SUM(VLOOKUP($C102,'Staffing and Finance Data Entry'!$A$30:$P$60,$D102,FALSE)*'Staffing and Finance Data Entry'!$D$24)))","v":"XXX"}]
[null,null,12,9,"Staffing-AfC5-Q9",null,"CH-Staffing-AfC5-Q9","AfC 5 - Trainee Biomedical Scientist - Externally Funded",{"$f":"IF(ISERROR(VLOOKUP($C103,'Staffing and Finance Data Entry'!$A$30:$P$60,$D103,FALSE))=TRUE,\"XXX\",IF(VLOOKUP($C103,'Staffing and Finance Data Entry'!$A$30:$P$60,$D103,FALSE)=0,\"XXX\",SUM(VLOOKUP($C103,'Staffing and Finance Data Entry'!$A$30:$P$60,$D103,FALSE)*'Staffing and Finance Data Entry'!$D$24)))","v":"XXX"}]
[null,null,13,9,"Staffing-AfC5-Q11",null,"CH-Staffing-AfC5-Q11","AfC 5 - Laboratory Support Worker/Medical Laboratory Assistant (MLA)",{"$f":"IF(ISERROR(VLOOKUP($C104,'Staffing and Finance Data Entry'!$A$30:$P$60,$D104,FALSE))=TRUE,\"XXX\",IF(VLOOKUP($C104,'Staffing and Finance Data Entry'!$A$30:$P$60,$D104,FALSE)=0,\"XXX\",VLOOKUP($C104,'Staffing and Finance Data Entry'!$A$30:$P$60,$D104,FALSE)))","v":"XXX"}]
[null,null,14,9,"Staffing-AfC5-Q12",null,"CH-Staffing-AfC5-Q12","AfC 5 - Associate Practitioner",{"$f":"IF(ISERROR(VLOOKUP($C105,'Staffing and Finance Data Entry'!$A$30:$P$60,$D105,FALSE))=TRUE,\"XXX\",IF(VLOOKUP($C105,'Staffing and Finance Data Entry'!$A$30:$P$60,$D105,FALSE)=0,\"XXX\",VLOOKUP($C105,'Staffing and Finance Data Entry'!$A$30:$P$60,$D105,FALSE)))","v":"XXX"}]
[null,null,15,9,"Staffing-AfC5-Q28",null,"CH-Staffing-AfC5-Q28","AfC 5 - Cytoscreeners",{"$f":"IF(ISERROR(VLOOKUP($C106,'Staffing and Finance Data Entry'!$A$30:$P$60,$D106,FALSE))=TRUE,\"XXX\",IF(VLOOKUP($C106,'Staffing and Finance Data Entry'!$A$30:$P$60,$D106,FALSE)=0,\"XXX\",VLOOKUP($C106,'Staffing and Finance Data Entry'!$A$30:$P$60,$D106,FALSE)))","v":"XXX"}]
[null,null,16,9,"Staffing-AfC5-Q14",null,"CH-Staffing-AfC5-Q14","AfC 5 - Administrative and Clerical Staff",{"$f":"IF(ISERROR(VLOOKUP($C107,'Staffing and Finance Data Entry'!$A$30:$P$60,$D107,FALSE))=TRUE,\"XXX\",IF(VLOOKUP($C107,'Staffing and Finance Data Entry'!$A$30:$P$60,$D107,FALSE)=0,\"XXX\",VLOOKUP($C107,'Staffing and Finance Data Entry'!$A$30:$P$60,$D107,FALSE)))","v":"XXX"}]
[null,null,17,9,"Staffing-AfC5-Q15",null,"CH-Staffing-AfC5-Q15","AfC 5 - Management Staff (Include Clinical Director, Finance Director, Lab Manager etc)",{"$f":"IF(ISERROR(VLOOKUP($C108,'Staffing and Finance Data Entry'!$A$30:$P$60,$D108,FALSE))=TRUE,\"XXX\",IF(VLOOKUP($C108,'Staffing and Finance Data Entry'!$A$30:$P$60,$D108,FALSE)=0,\"XXX\",VLOOKUP($C108,'Staffing and Finance Data Entry'!$A$30:$P$60,$D108,FALSE)))","v":"XXX"}]
[null,null,18,9,"Staffing-AfC5-Q16",null,"CH-Staffing-AfC5-Q16","AfC 5 - Quality Managers",{"$f":"IF(ISERROR(VLOOKUP($C109,'Staffing and Finance Data Entry'!$A$30:$P$60,$D109,FALSE))=TRUE,\"XXX\",IF(VLOOKUP($C109,'Staffing and Finance Data Entry'!$A$30:$P$60,$D109,FALSE)=0,\"XXX\",VLOOKUP($C109,'Staffing and Finance Data Entry'!$A$30:$P$60,$D109,FALSE)))","v":"XXX"}]
[null,null,19,9,"Staffing-AfC5-Q17",null,"CH-Staffing-AfC5-Q17","AfC 5 - IT Staff",{"$f":"IF(ISERROR(VLOOKUP($C110,'Staffing and Finance Data Entry'!$A$30:$P$60,$D110,FALSE))=TRUE,\"XXX\",IF(VLOOKUP($C110,'Staffing and Finance Data Entry'!$A$30:$P$60,$D110,FALSE)=0,\"XXX\",VLOOKUP($C110,'Staffing and Finance Data Entry'!$A$30:$P$60,$D110,FALSE)))","v":"XXX"}]
[null,null,20,9,"Staffing-AfC5-Q18",null,"CH-Staffing-AfC5-Q18","AfC 5 - Remaning Other Staff",{"$f":"IF(ISERROR(VLOOKUP($C111,'Staffing and Finance Data Entry'!$A$30:$P$60,$D111,FALSE))=TRUE,\"XXX\",IF(VLOOKUP($C111,'Staffing and Finance Data Entry'!$A$30:$P$60,$D111,FALSE)=0,\"XXX\",VLOOKUP($C111,'Staffing and Finance Data Entry'!$A$30:$P$60,$D111,FALSE)))","v":"XXX"}]
[null,null,21,9,"Staffing-AfC5-Q20",null,"CH-Staffing-AfC5-Q20","AfC 5 - Total",{"$f":"IF(SUM(I96:I111)=0,\"XXX\",SUM(I96:I111))","v":"XXX"}]
[null,null,6,10,"Staffing-AfC6-Q1",null,"CH-Staffing-AfC6-Q1","AfC 6 - Consultant Clinical Scientist",{"$f":"IF(ISERROR(VLOOKUP($C113,'Staffing and Finance Data Entry'!$A$30:$P$60,$D113,FALSE))=TRUE,\"XXX\",IF(VLOOKUP($C113,'Staffing and Finance Data Entry'!$A$30:$P$60,$D113,FALSE)=0,\"XXX\",VLOOKUP($C113,'Staffing and Finance Data Entry'!$A$30:$P$60,$D113,FALSE)))","v":"XXX"}]
[null,null,7,10,"Staffing-AfC6-Q2",null,"CH-Staffing-AfC6-Q2","AfC 6 - Non-Trainee, Non-Consultant Clinical Scientist",{"$f":"IF(ISERROR(VLOOKUP($C114,'Staffing and Finance Data Entry'!$A$30:$P$60,$D114,FALSE))=TRUE,\"XXX\",IF(VLOOKUP($C114,'Staffing and Finance Data Entry'!$A$30:$P$60,$D114,FALSE)=0,\"XXX\",VLOOKUP($C114,'Staffing and Finance Data Entry'!$A$30:$P$60,$D114,FALSE)))","v":"XXX"}]
[null,null,8,10,"Staffing-AfC6-Q3",null,"CH-Staffing-AfC6-Q3","AfC 6 - Trainee Clinical Scientist (eg STP) - Internally Funded",{"$f":"IF(ISERROR(VLOOKUP($C115,'Staffing and Finance Data Entry'!$A$30:$P$60,$D115,FALSE))=TRUE,\"XXX\",IF(VLOOKUP($C115,'Staffing and Finance Data Entry'!$A$30:$P$60,$D115,FALSE)=0,\"XXX\",SUM(VLOOKUP($C115,'Staffing and Finance Data Entry'!$A$30:$P$60,$D115,FALSE)*'Staffing and Finance Data Entry'!$D$23)))","v":"XXX"}]
[null,null,9,10,"Staffing-AfC6-Q4",null,"CH-Staffing-AfC6-Q4","AfC 6 - Trainee Clinical Scientist (eg STP) - Externally Funded",{"$f":"IF(ISERROR(VLOOKUP($C116,'Staffing and Finance Data Entry'!$A$30:$P$60,$D116,FALSE))=TRUE,\"XXX\",IF(VLOOKUP($C116,'Staffing and Finance Data Entry'!$A$30:$P$60,$D116,FALSE)=0,\"XXX\",SUM(VLOOKUP($C116,'Staffing and Finance Data Entry'!$A$30:$P$60,$D116,FALSE)*'Staffing and Finance Data Entry'!$D$23)))","v":"XXX"}]
[null,null,null,10,"Staffing-AfC6-Q6",null,"CH-Staffing-AfC6-Q6","AfC 6 - Consultant Biomedical Scientist",{"$f":"IF(ISERROR(VLOOKUP($C117,'Staffing and Finance Data Entry'!$A$30:$P$60,$D117,FALSE))=TRUE,\"XXX\",IF(VLOOKUP($C117,'Staffing and Finance Data Entry'!$A$30:$P$60,$D117,FALSE)=0,\"XXX\",VLOOKUP($C117,'Staffing and Finance Data Entry'!$A$30:$P$60,$D117,FALSE)))","v":"XXX"}]
[null,null,10,10,"Staffing-AfC6-Q7",null,"CH-Staffing-AfC6-Q7","AfC 6 - Non Trainee Biomedical Scientist",{"$f":"IF(ISERROR(VLOOKUP($C118,'Staffing and Finance Data Entry'!$A$30:$P$60,$D118,FALSE))=TRUE,\"XXX\",IF(VLOOKUP($C118,'Staffing and Finance Data Entry'!$A$30:$P$60,$D118,FALSE)=0,\"XXX\",VLOOKUP($C118,'Staffing and Finance Data Entry'!$A$30:$P$60,$D118,FALSE)))","v":"XXX"}]
[null,null,11,10,"Staffing-AfC6-Q8",null,"CH-Staffing-AfC6-Q8","AfC 6 - Trainee Biomedical Scientist - Internally Funded",{"$f":"IF(ISERROR(VLOOKUP($C119,'Staffing and Finance Data Entry'!$A$30:$P$60,$D119,FALSE))=TRUE,\"XXX\",IF(VLOOKUP($C119,'Staffing and Finance Data Entry'!$A$30:$P$60,$D119,FALSE)=0,\"XXX\",SUM(VLOOKUP($C119,'Staffing and Finance Data Entry'!$A$30:$P$60,$D119,FALSE)*'Staffing and Finance Data Entry'!$D$24)))","v":"XXX"}]
[null,null,12,10,"Staffing-AfC6-Q9",null,"CH-Staffing-AfC6-Q9","AfC 6 - Trainee Biomedical Scientist - Externally Funded",{"$f":"IF(ISERROR(VLOOKUP($C120,'Staffing and Finance Data Entry'!$A$30:$P$60,$D120,FALSE))=TRUE,\"XXX\",IF(VLOOKUP($C120,'Staffing and Finance Data Entry'!$A$30:$P$60,$D120,FALSE)=0,\"XXX\",SUM(VLOOKUP($C120,'Staffing and Finance Data Entry'!$A$30:$P$60,$D120,FALSE)*'Staffing and Finance Data Entry'!$D$24)))","v":"XXX"}]
[null,null,13,10,"Staffing-AfC6-Q11",null,"CH-Staffing-AfC6-Q11","AfC 6 - Laboratory Support Worker/Medical Laboratory Assistant (MLA)",{"$f":"IF(ISERROR(VLOOKUP($C121,'Staffing and Finance Data Entry'!$A$30:$P$60,$D121,FALSE))=TRUE,\"XXX\",IF(VLOOKUP($C121,'Staffing and Finance Data Entry'!$A$30:$P$60,$D121,FALSE)=0,\"XXX\",VLOOKUP($C121,'Staffing and Finance Data Entry'!$A$30:$P$60,$D121,FALSE)))","v":"XXX"}]
[null,null,14,10,"Staffing-AfC6-Q12",null,"CH-Staffing-AfC6-Q12","AfC 6 - Associate Practitioner",{"$f":"IF(ISERROR(VLOOKUP($C122,'Staffing and Finance Data Entry'!$A$30:$P$60,$D122,FALSE))=TRUE,\"XXX\",IF(VLOOKUP($C122,'Staffing and Finance Data Entry'!$A$30:$P$60,$D122,FALSE)=0,\"XXX\",VLOOKUP($C122,'Staffing and Finance Data Entry'!$A$30:$P$60,$D122,FALSE)))","v":"XXX"}]
[null,null,15,10,"Staffing-AfC6-Q28",null,"CH-Staffing-AfC6-Q28","AfC 6 - Cytoscreeners",{"$f":"IF(ISERROR(VLOOKUP($C123,'Staffing and Finance Data Entry'!$A$30:$P$60,$D123,FALSE))=TRUE,\"XXX\",IF(VLOOKUP($C123,'Staffing and Finance Data Entry'!$A$30:$P$60,$D123,FALSE)=0,\"XXX\",VLOOKUP($C123,'Staffing and Finance Data Entry'!$A$30:$P$60,$D123,FALSE)))","v":"XXX"}]
[null,null,16,10,"Staffing-AfC6-Q14",null,"CH-Staffing-AfC6-Q14","AfC 6 - Administrative and Clerical Staff",{"$f":"IF(ISERROR(VLOOKUP($C124,'Staffing and Finance Data Entry'!$A$30:$P$60,$D124,FALSE))=TRUE,\"XXX\",IF(VLOOKUP($C124,'Staffing and Finance Data Entry'!$A$30:$P$60,$D124,FALSE)=0,\"XXX\",VLOOKUP($C124,'Staffing and Finance Data Entry'!$A$30:$P$60,$D124,FALSE)))","v":"XXX"}]
[null,null,17,10,"Staffing-AfC6-Q15",null,"CH-Staffing-AfC6-Q15","AfC 6 - Management Staff (Include Clinical Director, Finance Director, Lab Manager etc)",{"$f":"IF(ISERROR(VLOOKUP($C125,'Staffing and Finance Data Entry'!$A$30:$P$60,$D125,FALSE))=TRUE,\"XXX\",IF(VLOOKUP($C125,'Staffing and Finance Data Entry'!$A$30:$P$60,$D125,FALSE)=0,\"XXX\",VLOOKUP($C125,'Staffing and Finance Data Entry'!$A$30:$P$60,$D125,FALSE)))","v":"XXX"}]
[null,null,18,10,"Staffing-AfC6-Q16",null,"CH-Staffing-AfC6-Q16","AfC 6 - Quality Managers",{"$f":"IF(ISERROR(VLOOKUP($C126,'Staffing and Finance Data Entry'!$A$30:$P$60,$D126,FALSE))=TRUE,\"XXX\",IF(VLOOKUP($C126,'Staffing and Finance Data Entry'!$A$30:$P$60,$D126,FALSE)=0,\"XXX\",VLOOKUP($C126,'Staffing and Finance Data Entry'!$A$30:$P$60,$D126,FALSE)))","v":"XXX"}]
[null,null,19,10,"Staffing-AfC6-Q17",null,"CH-Staffing-AfC6-Q17","AfC 6 - IT Staff",{"$f":"IF(ISERROR(VLOOKUP($C127,'Staffing and Finance Data Entry'!$A$30:$P$60,$D127,FALSE))=TRUE,\"XXX\",IF(VLOOKUP($C127,'Staffing and Finance Data Entry'!$A$30:$P$60,$D127,FALSE)=0,\"XXX\",VLOOKUP($C127,'Staffing and Finance Data Entry'!$A$30:$P$60,$D127,FALSE)))","v":"XXX"}]
[null,null,20,10,"Staffing-AfC6-Q18",null,"CH-Staffing-AfC6-Q18","AfC 6 - Remaning Other Staff",{"$f":"IF(ISERROR(VLOOKUP($C128,'Staffing and Finance Data Entry'!$A$30:$P$60,$D128,FALSE))=TRUE,\"XXX\",IF(VLOOKUP($C128,'Staffing and Finance Data Entry'!$A$30:$P$60,$D128,FALSE)=0,\"XXX\",VLOOKUP($C128,'Staffing and Finance Data Entry'!$A$30:$P$60,$D128,FALSE)))","v":"XXX"}]
[null,null,21,10,"Staffing-AfC6-Q20",null,"CH-Staffing-AfC6-Q20","AfC 6 - Total",{"$f":"IF(SUM(I113:I128)=0,\"XXX\",SUM(I113:I128))","v":"XXX"}]
[null,null,6,11,"Staffing-AfC7-Q1",null,"CH-Staffing-AfC7-Q1","AfC 7 - Consultant Clinical Scientist",{"$f":"IF(ISERROR(VLOOKUP($C130,'Staffing and Finance Data Entry'!$A$30:$P$60,$D130,FALSE))=TRUE,\"XXX\",IF(VLOOKUP($C130,'Staffing and Finance Data Entry'!$A$30:$P$60,$D130,FALSE)=0,\"XXX\",VLOOKUP($C130,'Staffing and Finance Data Entry'!$A$30:$P$60,$D130,FALSE)))","v":"XXX"}]
[null,null,7,11,"Staffing-AfC7-Q2",null,"CH-Staffing-AfC7-Q2","AfC 7 - Non-Trainee, Non-Consultant Clinical Scientist",{"$f":"IF(ISERROR(VLOOKUP($C131,'Staffing and Finance Data Entry'!$A$30:$P$60,$D131,FALSE))=TRUE,\"XXX\",IF(VLOOKUP($C131,'Staffing and Finance Data Entry'!$A$30:$P$60,$D131,FALSE)=0,\"XXX\",VLOOKUP($C131,'Staffing and Finance Data Entry'!$A$30:$P$60,$D131,FALSE)))","v":"XXX"}]
[null,null,8,11,"Staffing-AfC7-Q3",null,"CH-Staffing-AfC7-Q3","AfC 7 - Trainee Clinical Scientist (eg STP) - Internally Funded",{"$f":"IF(ISERROR(VLOOKUP($C132,'Staffing and Finance Data Entry'!$A$30:$P$60,$D132,FALSE))=TRUE,\"XXX\",IF(VLOOKUP($C132,'Staffing and Finance Data Entry'!$A$30:$P$60,$D132,FALSE)=0,\"XXX\",SUM(VLOOKUP($C132,'Staffing and Finance Data Entry'!$A$30:$P$60,$D132,FALSE)*'Staffing and Finance Data Entry'!$D$23)))","v":"XXX"}]
[null,null,9,11,"Staffing-AfC7-Q4",null,"CH-Staffing-AfC7-Q4","AfC 7 - Trainee Clinical Scientist (eg STP) - Externally Funded",{"$f":"IF(ISERROR(VLOOKUP($C133,'Staffing and Finance Data Entry'!$A$30:$P$60,$D133,FALSE))=TRUE,\"XXX\",IF(VLOOKUP($C133,'Staffing and Finance Data Entry'!$A$30:$P$60,$D133,FALSE)=0,\"XXX\",SUM(VLOOKUP($C133,'Staffing and Finance Data Entry'!$A$30:$P$60,$D133,FALSE)*'Staffing and Finance Data Entry'!$D$23)))","v":"XXX"}]
[null,null,null,11,"Staffing-AfC7-Q6",null,"CH-Staffing-AfC7-Q6","AfC 7 - Consultant Biomedical Scientist",{"$f":"IF(ISERROR(VLOOKUP($C134,'Staffing and Finance Data Entry'!$A$30:$P$60,$D134,FALSE))=TRUE,\"XXX\",IF(VLOOKUP($C134,'Staffing and Finance Data Entry'!$A$30:$P$60,$D134,FALSE)=0,\"XXX\",VLOOKUP($C134,'Staffing and Finance Data Entry'!$A$30:$P$60,$D134,FALSE)))","v":"XXX"}]
[null,null,10,11,"Staffing-AfC7-Q7",null,{"$f":"CONCATENATE($F$2,\"-\",E135)","v":"CH-Staffing-AfC7-Q7"},"AfC 7 - Non Trainee Biomedical Scientist",{"$f":"IF(ISERROR(VLOOKUP($C135,'Staffing and Finance Data Entry'!$A$30:$P$60,$D135,FALSE))=TRUE,\"XXX\",IF(VLOOKUP($C135,'Staffing and Finance Data Entry'!$A$30:$P$60,$D135,FALSE)=0,\"XXX\",VLOOKUP($C135,'Staffing and Finance Data Entry'!$A$30:$P$60,$D135,FALSE)))","v":"XXX"}]
[null,null,11,11,"Staffing-AfC7-Q8",null,"CH-Staffing-AfC7-Q8","AfC 7 - Trainee Biomedical Scientist - Internally Funded",{"$f":"IF(ISERROR(VLOOKUP($C136,'Staffing and Finance Data Entry'!$A$30:$P$60,$D136,FALSE))=TRUE,\"XXX\",IF(VLOOKUP($C136,'Staffing and Finance Data Entry'!$A$30:$P$60,$D136,FALSE)=0,\"XXX\",SUM(VLOOKUP($C136,'Staffing and Finance Data Entry'!$A$30:$P$60,$D136,FALSE)*'Staffing and Finance Data Entry'!$D$24)))","v":"XXX"}]
[null,null,12,11,"Staffing-AfC7-Q9",null,"CH-Staffing-AfC7-Q9","AfC 7 - Trainee Biomedical Scientist - Externally Funded",{"$f":"IF(ISERROR(VLOOKUP($C137,'Staffing and Finance Data Entry'!$A$30:$P$60,$D137,FALSE))=TRUE,\"XXX\",IF(VLOOKUP($C137,'Staffing and Finance Data Entry'!$A$30:$P$60,$D137,FALSE)=0,\"XXX\",SUM(VLOOKUP($C137,'Staffing and Finance Data Entry'!$A$30:$P$60,$D137,FALSE)*'Staffing and Finance Data Entry'!$D$24)))","v":"XXX"}]
[null,null,13,11,"Staffing-AfC7-Q11",null,"CH-Staffing-AfC7-Q11","AfC 7 - Laboratory Support Worker/Medical Laboratory Assistant (MLA)",{"$f":"IF(ISERROR(VLOOKUP($C138,'Staffing and Finance Data Entry'!$A$30:$P$60,$D138,FALSE))=TRUE,\"XXX\",IF(VLOOKUP($C138,'Staffing and Finance Data Entry'!$A$30:$P$60,$D138,FALSE)=0,\"XXX\",VLOOKUP($C138,'Staffing and Finance Data Entry'!$A$30:$P$60,$D138,FALSE)))","v":"XXX"}]
[null,null,14,11,"Staffing-AfC7-Q12",null,"CH-Staffing-AfC7-Q12","AfC 7 - Associate Practitioner",{"$f":"IF(ISERROR(VLOOKUP($C139,'Staffing and Finance Data Entry'!$A$30:$P$60,$D139,FALSE))=TRUE,\"XXX\",IF(VLOOKUP($C139,'Staffing and Finance Data Entry'!$A$30:$P$60,$D139,FALSE)=0,\"XXX\",VLOOKUP($C139,'Staffing and Finance Data Entry'!$A$30:$P$60,$D139,FALSE)))","v":"XXX"}]
[null,null,15,11,"Staffing-AfC7-Q28",null,"CH-Staffing-AfC7-Q28","AfC 7 - Cytoscreeners",{"$f":"IF(ISERROR(VLOOKUP($C140,'Staffing and Finance Data Entry'!$A$30:$P$60,$D140,FALSE))=TRUE,\"XXX\",IF(VLOOKUP($C140,'Staffing and Finance Data Entry'!$A$30:$P$60,$D140,FALSE)=0,\"XXX\",VLOOKUP($C140,'Staffing and Finance Data Entry'!$A$30:$P$60,$D140,FALSE)))","v":"XXX"}]
[null,null,16,11,"Staffing-AfC7-Q14",null,"CH-Staffing-AfC7-Q14","AfC 7 - Administrative and Clerical Staff",{"$f":"IF(ISERROR(VLOOKUP($C141,'Staffing and Finance Data Entry'!$A$30:$P$60,$D141,FALSE))=TRUE,\"XXX\",IF(VLOOKUP($C141,'Staffing and Finance Data Entry'!$A$30:$P$60,$D141,FALSE)=0,\"XXX\",VLOOKUP($C141,'Staffing and Finance Data Entry'!$A$30:$P$60,$D141,FALSE)))","v":"XXX"}]
[null,null,17,11,"Staffing-AfC7-Q15",null,"CH-Staffing-AfC7-Q15","AfC 7 - Management Staff (Include Clinical Director, Finance Director, Lab Manager etc)",{"$f":"IF(ISERROR(VLOOKUP($C142,'Staffing and Finance Data Entry'!$A$30:$P$60,$D142,FALSE))=TRUE,\"XXX\",IF(VLOOKUP($C142,'Staffing and Finance Data Entry'!$A$30:$P$60,$D142,FALSE)=0,\"XXX\",VLOOKUP($C142,'Staffing and Finance Data Entry'!$A$30:$P$60,$D142,FALSE)))","v":"XXX"}]
[null,null,18,11,"Staffing-AfC7-Q16",null,"CH-Staffing-AfC7-Q16","AfC 7 - Quality Managers",{"$f":"IF(ISERROR(VLOOKUP($C143,'Staffing and Finance Data Entry'!$A$30:$P$60,$D143,FALSE))=TRUE,\"XXX\",IF(VLOOKUP($C143,'Staffing and Finance Data Entry'!$A$30:$P$60,$D143,FALSE)=0,\"XXX\",VLOOKUP($C143,'Staffing and Finance Data Entry'!$A$30:$P$60,$D143,FALSE)))","v":"XXX"}]
[null,null,19,11,"Staffing-AfC7-Q17",null,"CH-Staffing-AfC7-Q17","AfC 7 - IT Staff",{"$f":"IF(ISERROR(VLOOKUP($C144,'Staffing and Finance Data Entry'!$A$30:$P$60,$D144,FALSE))=TRUE,\"XXX\",IF(VLOOKUP($C144,'Staffing and Finance Data Entry'!$A$30:$P$60,$D144,FALSE)=0,\"XXX\",VLOOKUP($C144,'Staffing and Finance Data Entry'!$A$30:$P$60,$D144,FALSE)))","v":"XXX"}]
[null,null,20,11,"Staffing-AfC7-Q18",null,"CH-Staffing-AfC7-Q18","AfC 7 - Remaning Other Staff",{"$f":"IF(ISERROR(VLOOKUP($C145,'Staffing and Finance Data Entry'!$A$30:$P$60,$D145,FALSE))=TRUE,\"XXX\",IF(VLOOKUP($C145,'Staffing and Finance Data Entry'!$A$30:$P$60,$D145,FALSE)=0,\"XXX\",VLOOKUP($C145,'Staffing and Finance Data Entry'!$A$30:$P$60,$D145,FALSE)))","v":"XXX"}]
[null,null,21,11,"Staffing-AfC7-Q20",null,"CH-Staffing-AfC7-Q20","AfC 7 - Total",{"$f":"IF(SUM(I130:I145)=0,\"XXX\",SUM(I130:I145))","v":"XXX"}]
[null,null,6,12,"Staffing-AfC8a-Q1",null,"CH-Staffing-AfC8a-Q1","AfC 8a - Consultant Clinical Scientist",{"$f":"IF(ISERROR(VLOOKUP($C147,'Staffing and Finance Data Entry'!$A$30:$P$60,$D147,FALSE))=TRUE,\"XXX\",IF(VLOOKUP($C147,'Staffing and Finance Data Entry'!$A$30:$P$60,$D147,FALSE)=0,\"XXX\",VLOOKUP($C147,'Staffing and Finance Data Entry'!$A$30:$P$60,$D147,FALSE)))","v":"XXX"}]
[null,null,7,12,"Staffing-AfC8a-Q2",null,"CH-Staffing-AfC8a-Q2","AfC 8a - Non-Trainee, Non-Consultant Clinical Scientist",{"$f":"IF(ISERROR(VLOOKUP($C148,'Staffing and Finance Data Entry'!$A$30:$P$60,$D148,FALSE))=TRUE,\"XXX\",IF(VLOOKUP($C148,'Staffing and Finance Data Entry'!$A$30:$P$60,$D148,FALSE)=0,\"XXX\",VLOOKUP($C148,'Staffing and Finance Data Entry'!$A$30:$P$60,$D148,FALSE)))","v":"XXX"}]
[null,null,8,12,"Staffing-AfC8a-Q3",null,"CH-Staffing-AfC8a-Q3","AfC 8a - Trainee Clinical Scientist (eg STP) - Internally Funded",{"$f":"IF(ISERROR(VLOOKUP($C149,'Staffing and Finance Data Entry'!$A$30:$P$60,$D149,FALSE))=TRUE,\"XXX\",IF(VLOOKUP($C149,'Staffing and Finance Data Entry'!$A$30:$P$60,$D149,FALSE)=0,\"XXX\",SUM(VLOOKUP($C149,'Staffing and Finance Data Entry'!$A$30:$P$60,$D149,FALSE)*'Staffing and Finance Data Entry'!$D$23)))","v":"XXX"}]
[null,null,9,12,"Staffing-AfC8a-Q4",null,"CH-Staffing-AfC8a-Q4","AfC 8a - Trainee Clinical Scientist (eg STP) - Externally Funded",{"$f":"IF(ISERROR(VLOOKUP($C150,'Staffing and Finance Data Entry'!$A$30:$P$60,$D150,FALSE))=TRUE,\"XXX\",IF(VLOOKUP($C150,'Staffing and Finance Data Entry'!$A$30:$P$60,$D150,FALSE)=0,\"XXX\",SUM(VLOOKUP($C150,'Staffing and Finance Data Entry'!$A$30:$P$60,$D150,FALSE)*'Staffing and Finance Data Entry'!$D$23)))","v":"XXX"}]
[null,null,null,12,"Staffing-AfC8a-Q6",null,"CH-Staffing-AfC8a-Q6","AfC 8a - Consultant Biomedical Scientist",{"$f":"IF(ISERROR(VLOOKUP($C151,'Staffing and Finance Data Entry'!$A$30:$P$60,$D151,FALSE))=TRUE,\"XXX\",IF(VLOOKUP($C151,'Staffing and Finance Data Entry'!$A$30:$P$60,$D151,FALSE)=0,\"XXX\",VLOOKUP($C151,'Staffing and Finance Data Entry'!$A$30:$P$60,$D151,FALSE)))","v":"XXX"}]
[null,null,10,12,"Staffing-AfC8a-Q7",null,"CH-Staffing-AfC8a-Q7","AfC 8a - Non Trainee Biomedical Scientist",{"$f":"IF(ISERROR(VLOOKUP($C152,'Staffing and Finance Data Entry'!$A$30:$P$60,$D152,FALSE))=TRUE,\"XXX\",IF(VLOOKUP($C152,'Staffing and Finance Data Entry'!$A$30:$P$60,$D152,FALSE)=0,\"XXX\",VLOOKUP($C152,'Staffing and Finance Data Entry'!$A$30:$P$60,$D152,FALSE)))","v":"XXX"}]
[null,null,11,12,"Staffing-AfC8a-Q8",null,"CH-Staffing-AfC8a-Q8","AfC 8a - Trainee Biomedical Scientist - Internally Funded",{"$f":"IF(ISERROR(VLOOKUP($C153,'Staffing and Finance Data Entry'!$A$30:$P$60,$D153,FALSE))=TRUE,\"XXX\",IF(VLOOKUP($C153,'Staffing and Finance Data Entry'!$A$30:$P$60,$D153,FALSE)=0,\"XXX\",SUM(VLOOKUP($C153,'Staffing and Finance Data Entry'!$A$30:$P$60,$D153,FALSE)*'Staffing and Finance Data Entry'!$D$24)))","v":"XXX"}]
[null,null,12,12,"Staffing-AfC8a-Q9",null,"CH-Staffing-AfC8a-Q9","AfC 8a - Trainee Biomedical Scientist - Externally Funded",{"$f":"IF(ISERROR(VLOOKUP($C154,'Staffing and Finance Data Entry'!$A$30:$P$60,$D154,FALSE))=TRUE,\"XXX\",IF(VLOOKUP($C154,'Staffing and Finance Data Entry'!$A$30:$P$60,$D154,FALSE)=0,\"XXX\",SUM(VLOOKUP($C154,'Staffing and Finance Data Entry'!$A$30:$P$60,$D154,FALSE)*'Staffing and Finance Data Entry'!$D$24)))","v":"XXX"}]
[null,null,13,12,"Staffing-AfC8a-Q11",null,"CH-Staffing-AfC8a-Q11","AfC 8a - Laboratory Support Worker/Medical Laboratory Assistant (MLA)",{"$f":"IF(ISERROR(VLOOKUP($C155,'Staffing and Finance Data Entry'!$A$30:$P$60,$D155,FALSE))=TRUE,\"XXX\",IF(VLOOKUP($C155,'Staffing and Finance Data Entry'!$A$30:$P$60,$D155,FALSE)=0,\"XXX\",VLOOKUP($C155,'Staffing and Finance Data Entry'!$A$30:$P$60,$D155,FALSE)))","v":"XXX"}]
[null,null,14,12,"Staffing-AfC8a-Q12",null,"CH-Staffing-AfC8a-Q12","AfC 8a - Associate Practitioner",{"$f":"IF(ISERROR(VLOOKUP($C156,'Staffing and Finance Data Entry'!$A$30:$P$60,$D156,FALSE))=TRUE,\"XXX\",IF(VLOOKUP($C156,'Staffing and Finance Data Entry'!$A$30:$P$60,$D156,FALSE)=0,\"XXX\",VLOOKUP($C156,'Staffing and Finance Data Entry'!$A$30:$P$60,$D156,FALSE)))","v":"XXX"}]
[null,null,15,12,"Staffing-AfC8a-Q28",null,"CH-Staffing-AfC8a-Q28","AfC 8a - Cytoscreeners",{"$f":"IF(ISERROR(VLOOKUP($C157,'Staffing and Finance Data Entry'!$A$30:$P$60,$D157,FALSE))=TRUE,\"XXX\",IF(VLOOKUP($C157,'Staffing and Finance Data Entry'!$A$30:$P$60,$D157,FALSE)=0,\"XXX\",VLOOKUP($C157,'Staffing and Finance Data Entry'!$A$30:$P$60,$D157,FALSE)))","v":"XXX"}]
[null,null,16,12,"Staffing-AfC8a-Q14",null,"CH-Staffing-AfC8a-Q14","AfC 8a - Administrative and Clerical Staff",{"$f":"IF(ISERROR(VLOOKUP($C158,'Staffing and Finance Data Entry'!$A$30:$P$60,$D158,FALSE))=TRUE,\"XXX\",IF(VLOOKUP($C158,'Staffing and Finance Data Entry'!$A$30:$P$60,$D158,FALSE)=0,\"XXX\",VLOOKUP($C158,'Staffing and Finance Data Entry'!$A$30:$P$60,$D158,FALSE)))","v":"XXX"}]
[null,null,17,12,"Staffing-AfC8a-Q15",null,"CH-Staffing-AfC8a-Q15","AfC 8a - Management Staff (Include Clinical Director, Finance Director, Lab Manager etc)",{"$f":"IF(ISERROR(VLOOKUP($C159,'Staffing and Finance Data Entry'!$A$30:$P$60,$D159,FALSE))=TRUE,\"XXX\",IF(VLOOKUP($C159,'Staffing and Finance Data Entry'!$A$30:$P$60,$D159,FALSE)=0,\"XXX\",VLOOKUP($C159,'Staffing and Finance Data Entry'!$A$30:$P$60,$D159,FALSE)))","v":"XXX"}]
[null,null,18,12,"Staffing-AfC8a-Q16",null,"CH-Staffing-AfC8a-Q16","AfC 8a - Quality Managers",{"$f":"IF(ISERROR(VLOOKUP($C160,'Staffing and Finance Data Entry'!$A$30:$P$60,$D160,FALSE))=TRUE,\"XXX\",IF(VLOOKUP($C160,'Staffing and Finance Data Entry'!$A$30:$P$60,$D160,FALSE)=0,\"XXX\",VLOOKUP($C160,'Staffing and Finance Data Entry'!$A$30:$P$60,$D160,FALSE)))","v":"XXX"}]
[null,null,19,12,"Staffing-AfC8a-Q17",null,"CH-Staffing-AfC8a-Q17","AfC 8a - IT Staff",{"$f":"IF(ISERROR(VLOOKUP($C161,'Staffing and Finance Data Entry'!$A$30:$P$60,$D161,FALSE))=TRUE,\"XXX\",IF(VLOOKUP($C161,'Staffing and Finance Data Entry'!$A$30:$P$60,$D161,FALSE)=0,\"XXX\",VLOOKUP($C161,'Staffing and Finance Data Entry'!$A$30:$P$60,$D161,FALSE)))","v":"XXX"}]
[null,null,20,12,"Staffing-AfC8a-Q18",null,"CH-Staffing-AfC8a-Q18","AfC 8a - Remaning Other Staff",{"$f":"IF(ISERROR(VLOOKUP($C162,'Staffing and Finance Data Entry'!$A$30:$P$60,$D162,FALSE))=TRUE,\"XXX\",IF(VLOOKUP($C162,'Staffing and Finance Data Entry'!$A$30:$P$60,$D162,FALSE)=0,\"XXX\",VLOOKUP($C162,'Staffing and Finance Data Entry'!$A$30:$P$60,$D162,FALSE)))","v":"XXX"}]
[null,null,21,12,"Staffing-AfC8a-Q20",null,"CH-Staffing-AfC8a-Q20","AfC 8a - Total",{"$f":"IF(SUM(I147:I162)=0,\"XXX\",SUM(I147:I162))","v":"XXX"}]
[null,null,6,13,"Staffing-AfC8b-Q1",null,"CH-Staffing-AfC8b-Q1","AfC 8b - Consultant Clinical Scientist",{"$f":"IF(ISERROR(VLOOKUP($C164,'Staffing and Finance Data Entry'!$A$30:$P$60,$D164,FALSE))=TRUE,\"XXX\",IF(VLOOKUP($C164,'Staffing and Finance Data Entry'!$A$30:$P$60,$D164,FALSE)=0,\"XXX\",VLOOKUP($C164,'Staffing and Finance Data Entry'!$A$30:$P$60,$D164,FALSE)))","v":"XXX"}]
[null,null,7,13,"Staffing-AfC8b-Q2",null,"CH-Staffing-AfC8b-Q2","AfC 8b - Non-Trainee, Non-Consultant Clinical Scientist",{"$f":"IF(ISERROR(VLOOKUP($C165,'Staffing and Finance Data Entry'!$A$30:$P$60,$D165,FALSE))=TRUE,\"XXX\",IF(VLOOKUP($C165,'Staffing and Finance Data Entry'!$A$30:$P$60,$D165,FALSE)=0,\"XXX\",VLOOKUP($C165,'Staffing and Finance Data Entry'!$A$30:$P$60,$D165,FALSE)))","v":"XXX"}]
[null,null,8,13,"Staffing-AfC8b-Q3",null,"CH-Staffing-AfC8b-Q3","AfC 8b - Trainee Clinical Scientist (eg STP) - Internally Funded",{"$f":"IF(ISERROR(VLOOKUP($C166,'Staffing and Finance Data Entry'!$A$30:$P$60,$D166,FALSE))=TRUE,\"XXX\",IF(VLOOKUP($C166,'Staffing and Finance Data Entry'!$A$30:$P$60,$D166,FALSE)=0,\"XXX\",SUM(VLOOKUP($C166,'Staffing and Finance Data Entry'!$A$30:$P$60,$D166,FALSE)*'Staffing and Finance Data Entry'!$D$23)))","v":"XXX"}]
[null,null,9,13,"Staffing-AfC8b-Q4",null,"CH-Staffing-AfC8b-Q4","AfC 8b - Trainee Clinical Scientist (eg STP) - Externally Funded",{"$f":"IF(ISERROR(VLOOKUP($C167,'Staffing and Finance Data Entry'!$A$30:$P$60,$D167,FALSE))=TRUE,\"XXX\",IF(VLOOKUP($C167,'Staffing and Finance Data Entry'!$A$30:$P$60,$D167,FALSE)=0,\"XXX\",SUM(VLOOKUP($C167,'Staffing and Finance Data Entry'!$A$30:$P$60,$D167,FALSE)*'Staffing and Finance Data Entry'!$D$23)))","v":"XXX"}]
[null,null,null,13,"Staffing-AfC8b-Q6",null,"CH-Staffing-AfC8b-Q6","AfC 8b - Consultant Biomedical Scientist",{"$f":"IF(ISERROR(VLOOKUP($C168,'Staffing and Finance Data Entry'!$A$30:$P$60,$D168,FALSE))=TRUE,\"XXX\",IF(VLOOKUP($C168,'Staffing and Finance Data Entry'!$A$30:$P$60,$D168,FALSE)=0,\"XXX\",VLOOKUP($C168,'Staffing and Finance Data Entry'!$A$30:$P$60,$D168,FALSE)))","v":"XXX"}]
[null,null,10,13,"Staffing-AfC8b-Q7",null,"CH-Staffing-AfC8b-Q7","AfC 8b - Non Trainee Biomedical Scientist",{"$f":"IF(ISERROR(VLOOKUP($C169,'Staffing and Finance Data Entry'!$A$30:$P$60,$D169,FALSE))=TRUE,\"XXX\",IF(VLOOKUP($C169,'Staffing and Finance Data Entry'!$A$30:$P$60,$D169,FALSE)=0,\"XXX\",VLOOKUP($C169,'Staffing and Finance Data Entry'!$A$30:$P$60,$D169,FALSE)))","v":"XXX"}]
[null,null,11,13,"Staffing-AfC8b-Q8",null,"CH-Staffing-AfC8b-Q8","AfC 8b - Trainee Biomedical Scientist - Internally Funded",{"$f":"IF(ISERROR(VLOOKUP($C170,'Staffing and Finance Data Entry'!$A$30:$P$60,$D170,FALSE))=TRUE,\"XXX\",IF(VLOOKUP($C170,'Staffing and Finance Data Entry'!$A$30:$P$60,$D170,FALSE)=0,\"XXX\",SUM(VLOOKUP($C170,'Staffing and Finance Data Entry'!$A$30:$P$60,$D170,FALSE)*'Staffing and Finance Data Entry'!$D$24)))","v":"XXX"}]
[null,null,12,13,"Staffing-AfC8b-Q9",null,"CH-Staffing-AfC8b-Q9","AfC 8b - Trainee Biomedical Scientist - Externally Funded",{"$f":"IF(ISERROR(VLOOKUP($C171,'Staffing and Finance Data Entry'!$A$30:$P$60,$D171,FALSE))=TRUE,\"XXX\",IF(VLOOKUP($C171,'Staffing and Finance Data Entry'!$A$30:$P$60,$D171,FALSE)=0,\"XXX\",SUM(VLOOKUP($C171,'Staffing and Finance Data Entry'!$A$30:$P$60,$D171,FALSE)*'Staffing and Finance Data Entry'!$D$24)))","v":"XXX"}]
[null,null,13,13,"Staffing-AfC8b-Q11",null,"CH-Staffing-AfC8b-Q11","AfC 8b - Laboratory Support Worker/Medical Laboratory Assistant (MLA)",{"$f":"IF(ISERROR(VLOOKUP($C172,'Staffing and Finance Data Entry'!$A$30:$P$60,$D172,FALSE))=TRUE,\"XXX\",IF(VLOOKUP($C172,'Staffing and Finance Data Entry'!$A$30:$P$60,$D172,FALSE)=0,\"XXX\",VLOOKUP($C172,'Staffing and Finance Data Entry'!$A$30:$P$60,$D172,FALSE)))","v":"XXX"}]
[null,null,14,13,"Staffing-AfC8b-Q12",null,"CH-Staffing-AfC8b-Q12","AfC 8b - Associate Practitioner",{"$f":"IF(ISERROR(VLOOKUP($C173,'Staffing and Finance Data Entry'!$A$30:$P$60,$D173,FALSE))=TRUE,\"XXX\",IF(VLOOKUP($C173,'Staffing and Finance Data Entry'!$A$30:$P$60,$D173,FALSE)=0,\"XXX\",VLOOKUP($C173,'Staffing and Finance Data Entry'!$A$30:$P$60,$D173,FALSE)))","v":"XXX"}]
[null,null,15,13,"Staffing-AfC8b-Q28",null,"CH-Staffing-AfC8b-Q28","AfC 8b - Cytoscreeners",{"$f":"IF(ISERROR(VLOOKUP($C174,'Staffing and Finance Data Entry'!$A$30:$P$60,$D174,FALSE))=TRUE,\"XXX\",IF(VLOOKUP($C174,'Staffing and Finance Data Entry'!$A$30:$P$60,$D174,FALSE)=0,\"XXX\",VLOOKUP($C174,'Staffing and Finance Data Entry'!$A$30:$P$60,$D174,FALSE)))","v":"XXX"}]
[null,null,16,13,"Staffing-AfC8b-Q14",null,"CH-Staffing-AfC8b-Q14","AfC 8b - Administrative and Clerical Staff",{"$f":"IF(ISERROR(VLOOKUP($C175,'Staffing and Finance Data Entry'!$A$30:$P$60,$D175,FALSE))=TRUE,\"XXX\",IF(VLOOKUP($C175,'Staffing and Finance Data Entry'!$A$30:$P$60,$D175,FALSE)=0,\"XXX\",VLOOKUP($C175,'Staffing and Finance Data Entry'!$A$30:$P$60,$D175,FALSE)))","v":"XXX"}]
[null,null,17,13,"Staffing-AfC8b-Q15",null,"CH-Staffing-AfC8b-Q15","AfC 8b - Management Staff (Include Clinical Director, Finance Director, Lab Manager etc)",{"$f":"IF(ISERROR(VLOOKUP($C176,'Staffing and Finance Data Entry'!$A$30:$P$60,$D176,FALSE))=TRUE,\"XXX\",IF(VLOOKUP($C176,'Staffing and Finance Data Entry'!$A$30:$P$60,$D176,FALSE)=0,\"XXX\",VLOOKUP($C176,'Staffing and Finance Data Entry'!$A$30:$P$60,$D176,FALSE)))","v":"XXX"}]
[null,null,18,13,"Staffing-AfC8b-Q16",null,"CH-Staffing-AfC8b-Q16","AfC 8b - Quality Managers",{"$f":"IF(ISERROR(VLOOKUP($C177,'Staffing and Finance Data Entry'!$A$30:$P$60,$D177,FALSE))=TRUE,\"XXX\",IF(VLOOKUP($C177,'Staffing and Finance Data Entry'!$A$30:$P$60,$D177,FALSE)=0,\"XXX\",VLOOKUP($C177,'Staffing and Finance Data Entry'!$A$30:$P$60,$D177,FALSE)))","v":"XXX"}]
[null,null,19,13,"Staffing-AfC8b-Q17",null,"CH-Staffing-AfC8b-Q17","AfC 8b - IT Staff",{"$f":"IF(ISERROR(VLOOKUP($C178,'Staffing and Finance Data Entry'!$A$30:$P$60,$D178,FALSE))=TRUE,\"XXX\",IF(VLOOKUP($C178,'Staffing and Finance Data Entry'!$A$30:$P$60,$D178,FALSE)=0,\"XXX\",VLOOKUP($C178,'Staffing and Finance Data Entry'!$A$30:$P$60,$D178,FALSE)))","v":"XXX"}]
[null,null,20,13,"Staffing-AfC8b-Q18",null,"CH-Staffing-AfC8b-Q18","AfC 8b - Remaning Other Staff",{"$f":"IF(ISERROR(VLOOKUP($C179,'Staffing and Finance Data Entry'!$A$30:$P$60,$D179,FALSE))=TRUE,\"XXX\",IF(VLOOKUP($C179,'Staffing and Finance Data Entry'!$A$30:$P$60,$D179,FALSE)=0,\"XXX\",VLOOKUP($C179,'Staffing and Finance Data Entry'!$A$30:$P$60,$D179,FALSE)))","v":"XXX"}]
[null,null,21,13,"Staffing-AfC8b-Q20",null,"CH-Staffing-AfC8b-Q20","AfC 8b - Total",{"$f":"IF(SUM(I164:I179)=0,\"XXX\",SUM(I164:I179))","v":"XXX"}]
[null,null,6,14,"Staffing-AfC8c-Q1",null,"CH-Staffing-AfC8c-Q1","AfC 8c - Consultant Clinical Scientist",{"$f":"IF(ISERROR(VLOOKUP($C181,'Staffing and Finance Data Entry'!$A$30:$P$60,$D181,FALSE))=TRUE,\"XXX\",IF(VLOOKUP($C181,'Staffing and Finance Data Entry'!$A$30:$P$60,$D181,FALSE)=0,\"XXX\",VLOOKUP($C181,'Staffing and Finance Data Entry'!$A$30:$P$60,$D181,FALSE)))","v":"XXX"}]
[null,null,7,14,"Staffing-AfC8c-Q2",null,"CH-Staffing-AfC8c-Q2","AfC 8c - Non-Trainee, Non-Consultant Clinical Scientist",{"$f":"IF(ISERROR(VLOOKUP($C182,'Staffing and Finance Data Entry'!$A$30:$P$60,$D182,FALSE))=TRUE,\"XXX\",IF(VLOOKUP($C182,'Staffing and Finance Data Entry'!$A$30:$P$60,$D182,FALSE)=0,\"XXX\",VLOOKUP($C182,'Staffing and Finance Data Entry'!$A$30:$P$60,$D182,FALSE)))","v":"XXX"}]
[null,null,8,14,"Staffing-AfC8c-Q3",null,"CH-Staffing-AfC8c-Q3","AfC 8c - Trainee Clinical Scientist (eg STP) - Internally Funded",{"$f":"IF(ISERROR(VLOOKUP($C183,'Staffing and Finance Data Entry'!$A$30:$P$60,$D183,FALSE))=TRUE,\"XXX\",IF(VLOOKUP($C183,'Staffing and Finance Data Entry'!$A$30:$P$60,$D183,FALSE)=0,\"XXX\",SUM(VLOOKUP($C183,'Staffing and Finance Data Entry'!$A$30:$P$60,$D183,FALSE)*'Staffing and Finance Data Entry'!$D$23)))","v":"XXX"}]
[null,null,9,14,"Staffing-AfC8c-Q4",null,"CH-Staffing-AfC8c-Q4","AfC 8c - Trainee Clinical Scientist (eg STP) - Externally Funded",{"$f":"IF(ISERROR(VLOOKUP($C184,'Staffing and Finance Data Entry'!$A$30:$P$60,$D184,FALSE))=TRUE,\"XXX\",IF(VLOOKUP($C184,'Staffing and Finance Data Entry'!$A$30:$P$60,$D184,FALSE)=0,\"XXX\",SUM(VLOOKUP($C184,'Staffing and Finance Data Entry'!$A$30:$P$60,$D184,FALSE)*'Staffing and Finance Data Entry'!$D$23)))","v":"XXX"}]
[null,null,null,14,"Staffing-AfC8c-Q6",null,"CH-Staffing-AfC8c-Q6","AfC 8c - Consultant Biomedical Scientist",{"$f":"IF(ISERROR(VLOOKUP($C185,'Staffing and Finance Data Entry'!$A$30:$P$60,$D185,FALSE))=TRUE,\"XXX\",IF(VLOOKUP($C185,'Staffing and Finance Data Entry'!$A$30:$P$60,$D185,FALSE)=0,\"XXX\",VLOOKUP($C185,'Staffing and Finance Data Entry'!$A$30:$P$60,$D185,FALSE)))","v":"XXX"}]
[null,null,10,14,"Staffing-AfC8c-Q7",null,"CH-Staffing-AfC8c-Q7","AfC 8c - Non Trainee Biomedical Scientist",{"$f":"IF(ISERROR(VLOOKUP($C186,'Staffing and Finance Data Entry'!$A$30:$P$60,$D186,FALSE))=TRUE,\"XXX\",IF(VLOOKUP($C186,'Staffing and Finance Data Entry'!$A$30:$P$60,$D186,FALSE)=0,\"XXX\",VLOOKUP($C186,'Staffing and Finance Data Entry'!$A$30:$P$60,$D186,FALSE)))","v":"XXX"}]
[null,null,11,14,"Staffing-AfC8c-Q8",null,"CH-Staffing-AfC8c-Q8","AfC 8c - Trainee Biomedical Scientist - Internally Funded",{"$f":"IF(ISERROR(VLOOKUP($C187,'Staffing and Finance Data Entry'!$A$30:$P$60,$D187,FALSE))=TRUE,\"XXX\",IF(VLOOKUP($C187,'Staffing and Finance Data Entry'!$A$30:$P$60,$D187,FALSE)=0,\"XXX\",SUM(VLOOKUP($C187,'Staffing and Finance Data Entry'!$A$30:$P$60,$D187,FALSE)*'Staffing and Finance Data Entry'!$D$24)))","v":"XXX"}]
[null,null,12,14,"Staffing-AfC8c-Q9",null,"CH-Staffing-AfC8c-Q9","AfC 8c - Trainee Biomedical Scientist - Externally Funded",{"$f":"IF(ISERROR(VLOOKUP($C188,'Staffing and Finance Data Entry'!$A$30:$P$60,$D188,FALSE))=TRUE,\"XXX\",IF(VLOOKUP($C188,'Staffing and Finance Data Entry'!$A$30:$P$60,$D188,FALSE)=0,\"XXX\",SUM(VLOOKUP($C188,'Staffing and Finance Data Entry'!$A$30:$P$60,$D188,FALSE)*'Staffing and Finance Data Entry'!$D$24)))","v":"XXX"}]
[null,null,13,14,"Staffing-AfC8c-Q11",null,"CH-Staffing-AfC8c-Q11","AfC 8c - Laboratory Support Worker/Medical Laboratory Assistant (MLA)",{"$f":"IF(ISERROR(VLOOKUP($C189,'Staffing and Finance Data Entry'!$A$30:$P$60,$D189,FALSE))=TRUE,\"XXX\",IF(VLOOKUP($C189,'Staffing and Finance Data Entry'!$A$30:$P$60,$D189,FALSE)=0,\"XXX\",VLOOKUP($C189,'Staffing and Finance Data Entry'!$A$30:$P$60,$D189,FALSE)))","v":"XXX"}]
[null,null,14,14,"Staffing-AfC8c-Q12",null,"CH-Staffing-AfC8c-Q12","AfC 8c - Associate Practitioner",{"$f":"IF(ISERROR(VLOOKUP($C190,'Staffing and Finance Data Entry'!$A$30:$P$60,$D190,FALSE))=TRUE,\"XXX\",IF(VLOOKUP($C190,'Staffing and Finance Data Entry'!$A$30:$P$60,$D190,FALSE)=0,\"XXX\",VLOOKUP($C190,'Staffing and Finance Data Entry'!$A$30:$P$60,$D190,FALSE)))","v":"XXX"}]
[null,null,15,14,"Staffing-AfC8c-Q28",null,"CH-Staffing-AfC8c-Q28","AfC 8c - Cytoscreeners",{"$f":"IF(ISERROR(VLOOKUP($C191,'Staffing and Finance Data Entry'!$A$30:$P$60,$D191,FALSE))=TRUE,\"XXX\",IF(VLOOKUP($C191,'Staffing and Finance Data Entry'!$A$30:$P$60,$D191,FALSE)=0,\"XXX\",VLOOKUP($C191,'Staffing and Finance Data Entry'!$A$30:$P$60,$D191,FALSE)))","v":"XXX"}]
[null,null,16,14,"Staffing-AfC8c-Q14",null,"CH-Staffing-AfC8c-Q14","AfC 8c - Administrative and Clerical Staff",{"$f":"IF(ISERROR(VLOOKUP($C192,'Staffing and Finance Data Entry'!$A$30:$P$60,$D192,FALSE))=TRUE,\"XXX\",IF(VLOOKUP($C192,'Staffing and Finance Data Entry'!$A$30:$P$60,$D192,FALSE)=0,\"XXX\",VLOOKUP($C192,'Staffing and Finance Data Entry'!$A$30:$P$60,$D192,FALSE)))","v":"XXX"}]
[null,null,17,14,"Staffing-AfC8c-Q15",null,"CH-Staffing-AfC8c-Q15","AfC 8c - Management Staff (Include Clinical Director, Finance Director, Lab Manager etc)",{"$f":"IF(ISERROR(VLOOKUP($C193,'Staffing and Finance Data Entry'!$A$30:$P$60,$D193,FALSE))=TRUE,\"XXX\",IF(VLOOKUP($C193,'Staffing and Finance Data Entry'!$A$30:$P$60,$D193,FALSE)=0,\"XXX\",VLOOKUP($C193,'Staffing and Finance Data Entry'!$A$30:$P$60,$D193,FALSE)))","v":"XXX"}]
[null,null,18,14,"Staffing-AfC8c-Q16",null,"CH-Staffing-AfC8c-Q16","AfC 8c - Quality Managers",{"$f":"IF(ISERROR(VLOOKUP($C194,'Staffing and Finance Data Entry'!$A$30:$P$60,$D194,FALSE))=TRUE,\"XXX\",IF(VLOOKUP($C194,'Staffing and Finance Data Entry'!$A$30:$P$60,$D194,FALSE)=0,\"XXX\",VLOOKUP($C194,'Staffing and Finance Data Entry'!$A$30:$P$60,$D194,FALSE)))","v":"XXX"}]
[null,null,19,14,"Staffing-AfC8c-Q17",null,"CH-Staffing-AfC8c-Q17","AfC 8c - IT Staff",{"$f":"IF(ISERROR(VLOOKUP($C195,'Staffing and Finance Data Entry'!$A$30:$P$60,$D195,FALSE))=TRUE,\"XXX\",IF(VLOOKUP($C195,'Staffing and Finance Data Entry'!$A$30:$P$60,$D195,FALSE)=0,\"XXX\",VLOOKUP($C195,'Staffing and Finance Data Entry'!$A$30:$P$60,$D195,FALSE)))","v":"XXX"}]
[null,null,20,14,"Staffing-AfC8c-Q18",null,"CH-Staffing-AfC8c-Q18","AfC 8c - Remaning Other Staff",{"$f":"IF(ISERROR(VLOOKUP($C196,'Staffing and Finance Data Entry'!$A$30:$P$60,$D196,FALSE))=TRUE,\"XXX\",IF(VLOOKUP($C196,'Staffing and Finance Data Entry'!$A$30:$P$60,$D196,FALSE)=0,\"XXX\",VLOOKUP($C196,'Staffing and Finance Data Entry'!$A$30:$P$60,$D196,FALSE)))","v":"XXX"}]
[null,null,21,14,"Staffing-AfC8c-Q20",null,"CH-Staffing-AfC8c-Q20","AfC 8c - Total",{"$f":"IF(SUM(I181:I196)=0,\"XXX\",SUM(I181:I196))","v":"XXX"}]
[null,null,6,15,"Staffing-AfC8d-Q1",null,"CH-Staffing-AfC8d-Q1","AfC 8d - Consultant Clinical Scientist",{"$f":"IF(ISERROR(VLOOKUP($C198,'Staffing and Finance Data Entry'!$A$30:$P$60,$D198,FALSE))=TRUE,\"XXX\",IF(VLOOKUP($C198,'Staffing and Finance Data Entry'!$A$30:$P$60,$D198,FALSE)=0,\"XXX\",VLOOKUP($C198,'Staffing and Finance Data Entry'!$A$30:$P$60,$D198,FALSE)))","v":"XXX"}]
[null,null,7,15,"Staffing-AfC8d-Q2",null,{"$f":"CONCATENATE($F$2,\"-\",E199)","v":"CH-Staffing-AfC8d-Q2"},"AfC 8d - Non-Trainee, Non-Consultant Clinical Scientist",{"$f":"IF(ISERROR(VLOOKUP($C199,'Staffing and Finance Data Entry'!$A$30:$P$60,$D199,FALSE))=TRUE,\"XXX\",IF(VLOOKUP($C199,'Staffing and Finance Data Entry'!$A$30:$P$60,$D199,FALSE)=0,\"XXX\",VLOOKUP($C199,'Staffing and Finance Data Entry'!$A$30:$P$60,$D199,FALSE)))","v":"XXX"}]
[null,null,8,15,"Staffing-AfC8d-Q3",null,"CH-Staffing-AfC8d-Q3","AfC 8d - Trainee Clinical Scientist (eg STP) - Internally Funded",{"$f":"IF(ISERROR(VLOOKUP($C200,'Staffing and Finance Data Entry'!$A$30:$P$60,$D200,FALSE))=TRUE,\"XXX\",IF(VLOOKUP($C200,'Staffing and Finance Data Entry'!$A$30:$P$60,$D200,FALSE)=0,\"XXX\",SUM(VLOOKUP($C200,'Staffing and Finance Data Entry'!$A$30:$P$60,$D200,FALSE)*'Staffing and Finance Data Entry'!$D$23)))","v":"XXX"}]
[null,null,9,15,"Staffing-AfC8d-Q4",null,"CH-Staffing-AfC8d-Q4","AfC 8d - Trainee Clinical Scientist (eg STP) - Externally Funded",{"$f":"IF(ISERROR(VLOOKUP($C201,'Staffing and Finance Data Entry'!$A$30:$P$60,$D201,FALSE))=TRUE,\"XXX\",IF(VLOOKUP($C201,'Staffing and Finance Data Entry'!$A$30:$P$60,$D201,FALSE)=0,\"XXX\",SUM(VLOOKUP($C201,'Staffing and Finance Data Entry'!$A$30:$P$60,$D201,FALSE)*'Staffing and Finance Data Entry'!$D$23)))","v":"XXX"}]
[null,null,null,15,"Staffing-AfC8d-Q6",null,"CH-Staffing-AfC8d-Q6","AfC 8d - Consultant Biomedical Scientist",{"$f":"IF(ISERROR(VLOOKUP($C202,'Staffing and Finance Data Entry'!$A$30:$P$60,$D202,FALSE))=TRUE,\"XXX\",IF(VLOOKUP($C202,'Staffing and Finance Data Entry'!$A$30:$P$60,$D202,FALSE)=0,\"XXX\",VLOOKUP($C202,'Staffing and Finance Data Entry'!$A$30:$P$60,$D202,FALSE)))","v":"XXX"}]
[null,null,10,15,"Staffing-AfC8d-Q7",null,"CH-Staffing-AfC8d-Q7","AfC 8d - Non Trainee Biomedical Scientist",{"$f":"IF(ISERROR(VLOOKUP($C203,'Staffing and Finance Data Entry'!$A$30:$P$60,$D203,FALSE))=TRUE,\"XXX\",IF(VLOOKUP($C203,'Staffing and Finance Data Entry'!$A$30:$P$60,$D203,FALSE)=0,\"XXX\",VLOOKUP($C203,'Staffing and Finance Data Entry'!$A$30:$P$60,$D203,FALSE)))","v":"XXX"}]
[null,null,11,15,"Staffing-AfC8d-Q8",null,"CH-Staffing-AfC8d-Q8","AfC 8d - Trainee Biomedical Scientist - Internally Funded",{"$f":"IF(ISERROR(VLOOKUP($C204,'Staffing and Finance Data Entry'!$A$30:$P$60,$D204,FALSE))=TRUE,\"XXX\",IF(VLOOKUP($C204,'Staffing and Finance Data Entry'!$A$30:$P$60,$D204,FALSE)=0,\"XXX\",SUM(VLOOKUP($C204,'Staffing and Finance Data Entry'!$A$30:$P$60,$D204,FALSE)*'Staffing and Finance Data Entry'!$D$24)))","v":"XXX"}]
[null,null,12,15,"Staffing-AfC8d-Q9",null,"CH-Staffing-AfC8d-Q9","AfC 8d - Trainee Biomedical Scientist - Externally Funded",{"$f":"IF(ISERROR(VLOOKUP($C205,'Staffing and Finance Data Entry'!$A$30:$P$60,$D205,FALSE))=TRUE,\"XXX\",IF(VLOOKUP($C205,'Staffing and Finance Data Entry'!$A$30:$P$60,$D205,FALSE)=0,\"XXX\",SUM(VLOOKUP($C205,'Staffing and Finance Data Entry'!$A$30:$P$60,$D205,FALSE)*'Staffing and Finance Data Entry'!$D$24)))","v":"XXX"}]
[null,null,13,15,"Staffing-AfC8d-Q11",null,"CH-Staffing-AfC8d-Q11","AfC 8d - Laboratory Support Worker/Medical Laboratory Assistant (MLA)",{"$f":"IF(ISERROR(VLOOKUP($C206,'Staffing and Finance Data Entry'!$A$30:$P$60,$D206,FALSE))=TRUE,\"XXX\",IF(VLOOKUP($C206,'Staffing and Finance Data Entry'!$A$30:$P$60,$D206,FALSE)=0,\"XXX\",VLOOKUP($C206,'Staffing and Finance Data Entry'!$A$30:$P$60,$D206,FALSE)))","v":"XXX"}]
[null,null,14,15,"Staffing-AfC8d-Q12",null,"CH-Staffing-AfC8d-Q12","AfC 8d - Associate Practitioner",{"$f":"IF(ISERROR(VLOOKUP($C207,'Staffing and Finance Data Entry'!$A$30:$P$60,$D207,FALSE))=TRUE,\"XXX\",IF(VLOOKUP($C207,'Staffing and Finance Data Entry'!$A$30:$P$60,$D207,FALSE)=0,\"XXX\",VLOOKUP($C207,'Staffing and Finance Data Entry'!$A$30:$P$60,$D207,FALSE)))","v":"XXX"}]
[null,null,15,15,"Staffing-AfC8d-Q28",null,"CH-Staffing-AfC8d-Q28","AfC 8d - Cytoscreeners",{"$f":"IF(ISERROR(VLOOKUP($C208,'Staffing and Finance Data Entry'!$A$30:$P$60,$D208,FALSE))=TRUE,\"XXX\",IF(VLOOKUP($C208,'Staffing and Finance Data Entry'!$A$30:$P$60,$D208,FALSE)=0,\"XXX\",VLOOKUP($C208,'Staffing and Finance Data Entry'!$A$30:$P$60,$D208,FALSE)))","v":"XXX"}]
[null,null,16,15,"Staffing-AfC8d-Q14",null,"CH-Staffing-AfC8d-Q14","AfC 8d - Administrative and Clerical Staff",{"$f":"IF(ISERROR(VLOOKUP($C209,'Staffing and Finance Data Entry'!$A$30:$P$60,$D209,FALSE))=TRUE,\"XXX\",IF(VLOOKUP($C209,'Staffing and Finance Data Entry'!$A$30:$P$60,$D209,FALSE)=0,\"XXX\",VLOOKUP($C209,'Staffing and Finance Data Entry'!$A$30:$P$60,$D209,FALSE)))","v":"XXX"}]
[null,null,17,15,"Staffing-AfC8d-Q15",null,"CH-Staffing-AfC8d-Q15","AfC 8d - Management Staff (Include Clinical Director, Finance Director, Lab Manager etc)",{"$f":"IF(ISERROR(VLOOKUP($C210,'Staffing and Finance Data Entry'!$A$30:$P$60,$D210,FALSE))=TRUE,\"XXX\",IF(VLOOKUP($C210,'Staffing and Finance Data Entry'!$A$30:$P$60,$D210,FALSE)=0,\"XXX\",VLOOKUP($C210,'Staffing and Finance Data Entry'!$A$30:$P$60,$D210,FALSE)))","v":"XXX"}]
[null,null,18,15,"Staffing-AfC8d-Q16",null,"CH-Staffing-AfC8d-Q16","AfC 8d - Quality Managers",{"$f":"IF(ISERROR(VLOOKUP($C211,'Staffing and Finance Data Entry'!$A$30:$P$60,$D211,FALSE))=TRUE,\"XXX\",IF(VLOOKUP($C211,'Staffing and Finance Data Entry'!$A$30:$P$60,$D211,FALSE)=0,\"XXX\",VLOOKUP($C211,'Staffing and Finance Data Entry'!$A$30:$P$60,$D211,FALSE)))","v":"XXX"}]
[null,null,19,15,"Staffing-AfC8d-Q17",null,"CH-Staffing-AfC8d-Q17","AfC 8d - IT Staff",{"$f":"IF(ISERROR(VLOOKUP($C212,'Staffing and Finance Data Entry'!$A$30:$P$60,$D212,FALSE))=TRUE,\"XXX\",IF(VLOOKUP($C212,'Staffing and Finance Data Entry'!$A$30:$P$60,$D212,FALSE)=0,\"XXX\",VLOOKUP($C212,'Staffing and Finance Data Entry'!$A$30:$P$60,$D212,FALSE)))","v":"XXX"}]
[null,null,20,15,"Staffing-AfC8d-Q18",null,"CH-Staffing-AfC8d-Q18","AfC 8d - Remaning Other Staff",{"$f":"IF(ISERROR(VLOOKUP($C213,'Staffing and Finance Data Entry'!$A$30:$P$60,$D213,FALSE))=TRUE,\"XXX\",IF(VLOOKUP($C213,'Staffing and Finance Data Entry'!$A$30:$P$60,$D213,FALSE)=0,\"XXX\",VLOOKUP($C213,'Staffing and Finance Data Entry'!$A$30:$P$60,$D213,FALSE)))","v":"XXX"}]
[null,null,21,15,"Staffing-AfC8d-Q20",null,"CH-Staffing-AfC8d-Q20","AfC 8d - Total",{"$f":"IF(SUM(I198:I213)=0,\"XXX\",SUM(I198:I213))","v":"XXX"}]
[null,null,6,16,"Staffing-AfC9-Q1",null,"CH-Staffing-AfC9-Q1","AfC 9 - Consultant Clinical Scientist",{"$f":"IF(ISERROR(VLOOKUP($C215,'Staffing and Finance Data Entry'!$A$30:$P$60,$D215,FALSE))=TRUE,\"XXX\",IF(VLOOKUP($C215,'Staffing and Finance Data Entry'!$A$30:$P$60,$D215,FALSE)=0,\"XXX\",VLOOKUP($C215,'Staffing and Finance Data Entry'!$A$30:$P$60,$D215,FALSE)))","v":"XXX"}]
[null,null,7,16,"Staffing-AfC9-Q2",null,"CH-Staffing-AfC9-Q2","AfC 9 - Non-Trainee, Non-Consultant Clinical Scientist",{"$f":"IF(ISERROR(VLOOKUP($C216,'Staffing and Finance Data Entry'!$A$30:$P$60,$D216,FALSE))=TRUE,\"XXX\",IF(VLOOKUP($C216,'Staffing and Finance Data Entry'!$A$30:$P$60,$D216,FALSE)=0,\"XXX\",VLOOKUP($C216,'Staffing and Finance Data Entry'!$A$30:$P$60,$D216,FALSE)))","v":"XXX"}]
[null,null,8,16,"Staffing-AfC9-Q3",null,"CH-Staffing-AfC9-Q3","AfC 9 - Trainee Clinical Scientist (eg STP) - Internally Funded",{"$f":"IF(ISERROR(VLOOKUP($C217,'Staffing and Finance Data Entry'!$A$30:$P$60,$D217,FALSE))=TRUE,\"XXX\",IF(VLOOKUP($C217,'Staffing and Finance Data Entry'!$A$30:$P$60,$D217,FALSE)=0,\"XXX\",SUM(VLOOKUP($C217,'Staffing and Finance Data Entry'!$A$30:$P$60,$D217,FALSE)*'Staffing and Finance Data Entry'!$D$23)))","v":"XXX"}]
[null,null,9,16,"Staffing-AfC9-Q4",null,"CH-Staffing-AfC9-Q4","AfC 9 - Trainee Clinical Scientist (eg STP) - Externally Funded",{"$f":"IF(ISERROR(VLOOKUP($C218,'Staffing and Finance Data Entry'!$A$30:$P$60,$D218,FALSE))=TRUE,\"XXX\",IF(VLOOKUP($C218,'Staffing and Finance Data Entry'!$A$30:$P$60,$D218,FALSE)=0,\"XXX\",SUM(VLOOKUP($C218,'Staffing and Finance Data Entry'!$A$30:$P$60,$D218,FALSE)*'Staffing and Finance Data Entry'!$D$23)))","v":"XXX"}]
[null,null,null,16,"Staffing-AfC9-Q6",null,"CH-Staffing-AfC9-Q6","AfC 9 - Consultant Biomedical Scientist",{"$f":"IF(ISERROR(VLOOKUP($C219,'Staffing and Finance Data Entry'!$A$30:$P$60,$D219,FALSE))=TRUE,\"XXX\",IF(VLOOKUP($C219,'Staffing and Finance Data Entry'!$A$30:$P$60,$D219,FALSE)=0,\"XXX\",VLOOKUP($C219,'Staffing and Finance Data Entry'!$A$30:$P$60,$D219,FALSE)))","v":"XXX"}]
[null,null,10,16,"Staffing-AfC9-Q7",null,"CH-Staffing-AfC9-Q7","AfC 9 - Non Trainee Biomedical Scientist",{"$f":"IF(ISERROR(VLOOKUP($C220,'Staffing and Finance Data Entry'!$A$30:$P$60,$D220,FALSE))=TRUE,\"XXX\",IF(VLOOKUP($C220,'Staffing and Finance Data Entry'!$A$30:$P$60,$D220,FALSE)=0,\"XXX\",VLOOKUP($C220,'Staffing and Finance Data Entry'!$A$30:$P$60,$D220,FALSE)))","v":"XXX"}]
[null,null,11,16,"Staffing-AfC9-Q8",null,"CH-Staffing-AfC9-Q8","AfC 9 - Trainee Biomedical Scientist - Internally Funded",{"$f":"IF(ISERROR(VLOOKUP($C221,'Staffing and Finance Data Entry'!$A$30:$P$60,$D221,FALSE))=TRUE,\"XXX\",IF(VLOOKUP($C221,'Staffing and Finance Data Entry'!$A$30:$P$60,$D221,FALSE)=0,\"XXX\",SUM(VLOOKUP($C221,'Staffing and Finance Data Entry'!$A$30:$P$60,$D221,FALSE)*'Staffing and Finance Data Entry'!$D$24)))","v":"XXX"}]
[null,null,12,16,"Staffing-AfC9-Q9",null,"CH-Staffing-AfC9-Q9","AfC 9 - Trainee Biomedical Scientist - Externally Funded",{"$f":"IF(ISERROR(VLOOKUP($C222,'Staffing and Finance Data Entry'!$A$30:$P$60,$D222,FALSE))=TRUE,\"XXX\",IF(VLOOKUP($C222,'Staffing and Finance Data Entry'!$A$30:$P$60,$D222,FALSE)=0,\"XXX\",SUM(VLOOKUP($C222,'Staffing and Finance Data Entry'!$A$30:$P$60,$D222,FALSE)*'Staffing and Finance Data Entry'!$D$24)))","v":"XXX"}]
[null,null,13,16,"Staffing-AfC9-Q11",null,"CH-Staffing-AfC9-Q11","AfC 9 - Laboratory Support Worker/Medical Laboratory Assistant (MLA)",{"$f":"IF(ISERROR(VLOOKUP($C223,'Staffing and Finance Data Entry'!$A$30:$P$60,$D223,FALSE))=TRUE,\"XXX\",IF(VLOOKUP($C223,'Staffing and Finance Data Entry'!$A$30:$P$60,$D223,FALSE)=0,\"XXX\",VLOOKUP($C223,'Staffing and Finance Data Entry'!$A$30:$P$60,$D223,FALSE)))","v":"XXX"}]
[null,null,14,16,"Staffing-AfC9-Q12",null,"CH-Staffing-AfC9-Q12","AfC 9 - Associate Practitioner",{"$f":"IF(ISERROR(VLOOKUP($C224,'Staffing and Finance Data Entry'!$A$30:$P$60,$D224,FALSE))=TRUE,\"XXX\",IF(VLOOKUP($C224,'Staffing and Finance Data Entry'!$A$30:$P$60,$D224,FALSE)=0,\"XXX\",VLOOKUP($C224,'Staffing and Finance Data Entry'!$A$30:$P$60,$D224,FALSE)))","v":"XXX"}]
[null,null,15,16,"Staffing-AfC9-Q28",null,"CH-Staffing-AfC9-Q28","AfC 9 - Cytoscreeners",{"$f":"IF(ISERROR(VLOOKUP($C225,'Staffing and Finance Data Entry'!$A$30:$P$60,$D225,FALSE))=TRUE,\"XXX\",IF(VLOOKUP($C225,'Staffing and Finance Data Entry'!$A$30:$P$60,$D225,FALSE)=0,\"XXX\",VLOOKUP($C225,'Staffing and Finance Data Entry'!$A$30:$P$60,$D225,FALSE)))","v":"XXX"}]
[null,null,16,16,"Staffing-AfC9-Q14",null,"CH-Staffing-AfC9-Q14","AfC 9 - Administrative and Clerical Staff",{"$f":"IF(ISERROR(VLOOKUP($C226,'Staffing and Finance Data Entry'!$A$30:$P$60,$D226,FALSE))=TRUE,\"XXX\",IF(VLOOKUP($C226,'Staffing and Finance Data Entry'!$A$30:$P$60,$D226,FALSE)=0,\"XXX\",VLOOKUP($C226,'Staffing and Finance Data Entry'!$A$30:$P$60,$D226,FALSE)))","v":"XXX"}]
[null,null,17,16,"Staffing-AfC9-Q15",null,"CH-Staffing-AfC9-Q15","AfC 9 - Management Staff (Include Clinical Director, Finance Director, Lab Manager etc)",{"$f":"IF(ISERROR(VLOOKUP($C227,'Staffing and Finance Data Entry'!$A$30:$P$60,$D227,FALSE))=TRUE,\"XXX\",IF(VLOOKUP($C227,'Staffing and Finance Data Entry'!$A$30:$P$60,$D227,FALSE)=0,\"XXX\",VLOOKUP($C227,'Staffing and Finance Data Entry'!$A$30:$P$60,$D227,FALSE)))","v":"XXX"}]
[null,null,18,16,"Staffing-AfC9-Q16",null,"CH-Staffing-AfC9-Q16","AfC 9 - Quality Managers",{"$f":"IF(ISERROR(VLOOKUP($C228,'Staffing and Finance Data Entry'!$A$30:$P$60,$D228,FALSE))=TRUE,\"XXX\",IF(VLOOKUP($C228,'Staffing and Finance Data Entry'!$A$30:$P$60,$D228,FALSE)=0,\"XXX\",VLOOKUP($C228,'Staffing and Finance Data Entry'!$A$30:$P$60,$D228,FALSE)))","v":"XXX"}]
[null,null,19,16,"Staffing-AfC9-Q17",null,"CH-Staffing-AfC9-Q17","AfC 9 - IT Staff",{"$f":"IF(ISERROR(VLOOKUP($C229,'Staffing and Finance Data Entry'!$A$30:$P$60,$D229,FALSE))=TRUE,\"XXX\",IF(VLOOKUP($C229,'Staffing and Finance Data Entry'!$A$30:$P$60,$D229,FALSE)=0,\"XXX\",VLOOKUP($C229,'Staffing and Finance Data Entry'!$A$30:$P$60,$D229,FALSE)))","v":"XXX"}]
[null,null,20,16,"Staffing-AfC9-Q18",null,"CH-Staffing-AfC9-Q18","AfC 9 - Remaning Other Staff",{"$f":"IF(ISERROR(VLOOKUP($C230,'Staffing and Finance Data Entry'!$A$30:$P$60,$D230,FALSE))=TRUE,\"XXX\",IF(VLOOKUP($C230,'Staffing and Finance Data Entry'!$A$30:$P$60,$D230,FALSE)=0,\"XXX\",VLOOKUP($C230,'Staffing and Finance Data Entry'!$A$30:$P$60,$D230,FALSE)))","v":"XXX"}]
[null,null,21,16,"Staffing-AfC9-Q20",null,"CH-Staffing-AfC9-Q20","AfC 9 - Total",{"$f":"IF(SUM(I215:I230)=0,\"XXX\",SUM(I215:I230))","v":"XXX"}]
[]
[null,null,"Mid point salary calculations"]
[null,"AfC","Import Number","AfC Import","Raw Code","Salary Modifier - Selected Lab",null,"Descriptor"]
[null,null,1,null,"Salaries-Total-Q1",{"$f":"'Consultant Pay'!D46","v":139819.68000000119},{"$f":"CONCATENATE($F$2,\"-\",E235)","v":"CH-Salaries-Total-Q1"},"Total Salary - Medical Consultant",{"$f":"IF(I6=\"XXX\",\"XXX\",IF($F235=\"NA\",\"XXX\",SUM(I6*$F235)))","v":"XXX"}]
[null,null,2,null,"Salaries-Total-Q2",{"$f":"'Consultant Pay'!D47","v":128186.10000000108},"CH-Salaries-Total-Q2","Total Salary - Locum Consultants",{"$f":"IF(I7=\"XXX\",\"XXX\",IF($F236=\"NA\",\"XXX\",SUM(I7*$F236)))","v":"XXX"}]
[null,null,3,null,"Salaries-Total-Q3",{"$f":"'Consultant Pay'!D48","v":51828.210000000436},"CH-Salaries-Total-Q3","Total Salary - Junior Doctors/Specialty Trainees (Specialist Registrar/SpR) - Internally Funded",{"$f":"IF(I8=\"XXX\",\"XXX\",IF($F237=\"NA\",\"XXX\",SUM(I8*$F237*'AfC Spine Data'!$V$4)))","v":"XXX"}]
[null,null,4,null,"Salaries-Total-Q4","NA","CH-Salaries-Total-Q4","Total Salary - Junior Doctors/Specialty Trainees (Specialist Registrar/SpR) - Externally Funded","XXX"]
[null,null,5,null,"Salaries-Total-Q6",{"$f":"'Consultant Pay'!D49","v":44912.700000000375},"CH-Salaries-Total-Q6","Total Salary - Remaining Other Medical Staff",{"$f":"IF(I10=\"XXX\",\"XXX\",IF($F239=\"NA\",\"XXX\",SUM(I10*$F239)))","v":"XXX"}]
[null,null,6,null,"Salaries-Total-Q8","NA","CH-Salaries-Total-Q8","Total Salary - Consultant Clinical Scientist",{"$f":"IF(SUM(I257,I274,I291,I308,I325,I342,I359,I376,I393,I410,I427,I444)=0,\"XXX\",SUM(I257,I274,I291,I308,I325,I342,I359,I376,I393,I410,I427,I444))","v":"XXX"}]
[null,null,7,null,"Salaries-Total-Q9","NA","CH-Salaries-Total-Q9","Total Salary - Non-Trainee, Non-Consultant Clinical Scientist",{"$f":"IF(SUM(I258,I275,I292,I309,I326,I343,I360,I377,I394,I411,I428,I445)=0,\"XXX\",SUM(I258,I275,I292,I309,I326,I343,I360,I377,I394,I411,I428,I445))","v":"XXX"}]
[null,null,8,null,"Salaries-Total-Q10","NA","CH-Salaries-Total-Q10","Total Salary - Trainee Clinical Scientist (eg STP) - Internally Funded",{"$f":"IF(SUM(I259,I276,I293,I310,I327,I344,I361,I378,I395,I412,I429,I446)=0,\"XXX\",SUM(I259,I276,I293,I310,I327,I344,I361,I378,I395,I412,I429,I446))","v":"XXX"}]
[null,null,9,null,"Salaries-Total-Q11","NA","CH-Salaries-Total-Q11","Total Salary - Trainee Clinical Scientist (eg STP) - Externally Funded","XXX"]
[null,null,null,null,"Salaries-Total-Q13","NA","CH-Salaries-Total-Q13","Total Salary - Consultant Biomedical Scientist","XXX"]
[null,null,10,null,"Salaries-Total-Q14","NA","CH-Salaries-Total-Q14","Total Salary - Non Trainee Biomedical Scientist",{"$f":"IF(SUM(I262,I279,I296,I313,I330,I347,I364,I381,I398,I415,I432,I449)=0,\"XXX\",SUM(I262,I279,I296,I313,I330,I347,I364,I381,I398,I415,I432,I449))","v":"XXX"}]
[null,null,11,null,"Salaries-Total-Q15","NA","CH-Salaries-Total-Q15","Total Salary - Trainee Biomedical Scientist - Internally Funded",{"$f":"IF(SUM(I263,I280,I297,I314,I331,I348,I365,I382,I399,I416,I433,I450)=0,\"XXX\",SUM(I263,I280,I297,I314,I331,I348,I365,I382,I399,I416,I433,I450))","v":"XXX"}]
[null,null,12,null,"Salaries-Total-Q16","NA","CH-Salaries-Total-Q16","Total Salary - Trainee Biomedical Scientist - Externally Funded","XXX"]
[null,null,13,null,"Salaries-Total-Q18","NA","CH-Salaries-Total-Q18","Total Salary - Laboratory Support Worker/Medical Laboratory Assistant (MLA)",{"$f":"IF(SUM(I265,I282,I299,I316,I333,I350,I367,I384,I401,I418,I435,I452)=0,\"XXX\",SUM(I265,I282,I299,I316,I333,I350,I367,I384,I401,I418,I435,I452))","v":"XXX"}]
[null,null,14,null,"Salaries-Total-Q19","NA","CH-Salaries-Total-Q19","Total Salary - Associate Practitioner",{"$f":"IF(SUM(I266,I283,I300,I317,I334,I351,I368,I385,I402,I419,I436,I453)=0,\"XXX\",SUM(I266,I283,I300,I317,I334,I351,I368,I385,I402,I419,I436,I453))","v":"XXX"}]
[null,null,15,null,"Salaries-Total-Q28","NA","CH-Salaries-Total-Q28","Total Salary - Cytoscreeners",{"$f":"IF(SUM(I267,I284,I301,I318,I335,I352,I369,I386,I403,I420,I437,I454)=0,\"XXX\",SUM(I267,I284,I301,I318,I335,I352,I369,I386,I403,I420,I437,I454))","v":"XXX"}]
[null,null,16,null,"Salaries-Total-Q21","NA","CH-Salaries-Total-Q21","Total Salary - Administrative and Clerical Staff",{"$f":"IF(SUM(I268,I285,I302,I319,I336,I353,I370,I387,I404,I421,I438,I455)=0,\"XXX\",SUM(I268,I285,I302,I319,I336,I353,I370,I387,I404,I421,I438,I455))","v":"XXX"}]
[null,null,17,null,"Salaries-Total-Q22","NA","CH-Salaries-Total-Q22","Total Salary - Management Staff (Include Clinical Director, Finance Director, Lab Manager etc)",{"$f":"IF(SUM(I269,I286,I303,I320,I337,I354,I371,I388,I405,I422,I439,I456)=0,\"XXX\",SUM(I269,I286,I303,I320,I337,I354,I371,I388,I405,I422,I439,I456))","v":"XXX"}]
[null,null,18,null,"Salaries-Total-Q23","NA","CH-Salaries-Total-Q23","Total Salary - Quality Managers",{"$f":"IF(SUM(I270,I287,I304,I321,I338,I355,I372,I389,I406,I423,I440,I457)=0,\"XXX\",SUM(I270,I287,I304,I321,I338,I355,I372,I389,I406,I423,I440,I457))","v":"XXX"}]
[null,null,19,null,"Salaries-Total-Q24","NA","CH-Salaries-Total-Q24","Total Salary - IT Staff",{"$f":"IF(SUM(I271,I288,I305,I322,I339,I356,I373,I390,I407,I424,I441,I458)=0,\"XXX\",SUM(I271,I288,I305,I322,I339,I356,I373,I390,I407,I424,I441,I458))","v":"XXX"}]
[null,null,20,null,"Salaries-Total-Q25","NA","CH-Salaries-Total-Q25","Total Salary - Remaning Other Staff",{"$f":"IF(SUM(I272,I289,I306,I323,I340,I357,I374,I391,I408,I425,I442,I459)=0,\"XXX\",SUM(I272,I289,I306,I323,I340,I357,I374,I391,I408,I425,I442,I459))","v":"XXX"}]
[null,null,21,null,"Salaries-Total-Q27","NA","CH-Salaries-Total-Q27","Total Salary - Total",{"$f":"IF(SUM(I235:I255)=0,\"XXX\",SUM(SUM(I235:I255),'Staffing and Finance Data Entry'!D11))","v":"XXX"}]
[null,"1",6,19,"Salaries-AfC1-Q1",{"$f":"IF(ISERROR(VLOOKUP(CONCATENATE(B257,\"-\",VLOOKUP(C257,afcterms_table,D257,FALSE)),'AfC Spine Data'!$R$4:$S$94,2,FALSE))=TRUE,\"NA\",VLOOKUP(CONCATENATE(B257,\"-\",VLOOKUP(C257,afcterms_table,D257,FALSE)),'AfC Spine Data'!$R$4:$S$94,2,FALSE))","v":22241.52},"CH-Salaries-AfC1-Q1","AfC 1 - Consultant Clinical Scientist",{"$f":"IF(I28=\"XXX\",\"XXX\",IF($F257=\"NA\",\"XXX\",SUM(I28*$F257)))","v":"XXX"}]
[null,"1",7,19,"Salaries-AfC1-Q2",{"$f":"IF(ISERROR(VLOOKUP(CONCATENATE(B258,\"-\",VLOOKUP(C258,afcterms_table,D258,FALSE)),'AfC Spine Data'!$R$4:$S$94,2,FALSE))=TRUE,\"NA\",VLOOKUP(CONCATENATE(B258,\"-\",VLOOKUP(C258,afcterms_table,D258,FALSE)),'AfC Spine Data'!$R$4:$S$94,2,FALSE))","v":22241.52},"CH-Salaries-AfC1-Q2","AfC 1 - Non-Trainee, Non-Consultant Clinical Scientist",{"$f":"IF(I29=\"XXX\",\"XXX\",IF($F258=\"NA\",\"XXX\",SUM(I29*$F258)))","v":"XXX"}]
[null,"1",8,19,"Salaries-AfC1-Q3",{"$f":"IF(ISERROR(VLOOKUP(CONCATENATE(B259,\"-\",VLOOKUP(C259,afcterms_table,D259,FALSE)),'AfC Spine Data'!$R$4:$S$94,2,FALSE))=TRUE,\"NA\",VLOOKUP(CONCATENATE(B259,\"-\",VLOOKUP(C259,afcterms_table,D259,FALSE)),'AfC Spine Data'!$R$4:$S$94,2,FALSE))","v":22241.52},"CH-Salaries-AfC1-Q3","AfC 1 - Trainee Clinical Scientist (eg STP) - Internally Funded",{"$f":"IF(I30=\"XXX\",\"XXX\",IF($F259=\"NA\",\"XXX\",SUM(I30*$F259*'AfC Spine Data'!$V$5)))","v":"XXX"}]
[null,"1",9,19,"Salaries-AfC1-Q4",{"$f":"IF(ISERROR(VLOOKUP(CONCATENATE(B260,\"-\",VLOOKUP(C260,afcterms_table,D260,FALSE)),'AfC Spine Data'!$R$4:$S$94,2,FALSE))=TRUE,\"NA\",VLOOKUP(CONCATENATE(B260,\"-\",VLOOKUP(C260,afcterms_table,D260,FALSE)),'AfC Spine Data'!$R$4:$S$94,2,FALSE))","v":22241.52},"CH-Salaries-AfC1-Q4","AfC 1 - Trainee Clinical Scientist (eg STP) - Externally Funded","XXX"]
[null,"1",null,19,"Salaries-AfC1-Q6",{"$f":"IF(ISERROR(VLOOKUP(CONCATENATE(B261,\"-\",VLOOKUP(C261,afcterms_table,D261,FALSE)),'AfC Spine Data'!$R$4:$S$94,2,FALSE))=TRUE,\"NA\",VLOOKUP(CONCATENATE(B261,\"-\",VLOOKUP(C261,afcterms_table,D261,FALSE)),'AfC Spine Data'!$R$4:$S$94,2,FALSE))","v":"NA"},"CH-Salaries-AfC1-Q6","AfC 1 - Consultant Biomedical Scientist",{"$f":"IF(I32=\"XXX\",\"XXX\",IF($F261=\"NA\",\"XXX\",SUM(I32*$F261)))","v":"XXX"}]
[null,"1",10,19,"Salaries-AfC1-Q7",{"$f":"IF(ISERROR(VLOOKUP(CONCATENATE(B262,\"-\",VLOOKUP(C262,afcterms_table,D262,FALSE)),'AfC Spine Data'!$R$4:$S$94,2,FALSE))=TRUE,\"NA\",VLOOKUP(CONCATENATE(B262,\"-\",VLOOKUP(C262,afcterms_table,D262,FALSE)),'AfC Spine Data'!$R$4:$S$94,2,FALSE))","v":22241.52},"CH-Salaries-AfC1-Q7","AfC 1 - Non Trainee Biomedical Scientist",{"$f":"IF(I33=\"XXX\",\"XXX\",IF($F262=\"NA\",\"XXX\",SUM(I33*$F262)))","v":"XXX"}]
[null,"1",11,19,"Salaries-AfC1-Q8",{"$f":"IF(ISERROR(VLOOKUP(CONCATENATE(B263,\"-\",VLOOKUP(C263,afcterms_table,D263,FALSE)),'AfC Spine Data'!$R$4:$S$94,2,FALSE))=TRUE,\"NA\",VLOOKUP(CONCATENATE(B263,\"-\",VLOOKUP(C263,afcterms_table,D263,FALSE)),'AfC Spine Data'!$R$4:$S$94,2,FALSE))","v":22241.52},"CH-Salaries-AfC1-Q8","AfC 1 - Trainee Biomedical Scientist - Internally Funded",{"$f":"IF(I34=\"XXX\",\"XXX\",IF($F263=\"NA\",\"XXX\",SUM(I34*$F263*'AfC Spine Data'!$V$6)))","v":"XXX"}]
[null,"1",12,19,"Salaries-AfC1-Q9",{"$f":"IF(ISERROR(VLOOKUP(CONCATENATE(B264,\"-\",VLOOKUP(C264,afcterms_table,D264,FALSE)),'AfC Spine Data'!$R$4:$S$94,2,FALSE))=TRUE,\"NA\",VLOOKUP(CONCATENATE(B264,\"-\",VLOOKUP(C264,afcterms_table,D264,FALSE)),'AfC Spine Data'!$R$4:$S$94,2,FALSE))","v":22241.52},"CH-Salaries-AfC1-Q9","AfC 1 - Trainee Biomedical Scientist - Externally Funded","XXX"]
[null,"1",13,19,"Salaries-AfC1-Q11",{"$f":"IF(ISERROR(VLOOKUP(CONCATENATE(B265,\"-\",VLOOKUP(C265,afcterms_table,D265,FALSE)),'AfC Spine Data'!$R$4:$S$94,2,FALSE))=TRUE,\"NA\",VLOOKUP(CONCATENATE(B265,\"-\",VLOOKUP(C265,afcterms_table,D265,FALSE)),'AfC Spine Data'!$R$4:$S$94,2,FALSE))","v":22241.52},"CH-Salaries-AfC1-Q11","AfC 1 - Laboratory Support Worker/Medical Laboratory Assistant (MLA)",{"$f":"IF(I36=\"XXX\",\"XXX\",IF($F265=\"NA\",\"XXX\",SUM(I36*$F265)))","v":"XXX"}]
[null,"1",14,19,"Salaries-AfC1-Q12",{"$f":"IF(ISERROR(VLOOKUP(CONCATENATE(B266,\"-\",VLOOKUP(C266,afcterms_table,D266,FALSE)),'AfC Spine Data'!$R$4:$S$94,2,FALSE))=TRUE,\"NA\",VLOOKUP(CONCATENATE(B266,\"-\",VLOOKUP(C266,afcterms_table,D266,FALSE)),'AfC Spine Data'!$R$4:$S$94,2,FALSE))","v":22241.52},"CH-Salaries-AfC1-Q12","AfC 1 - Associate Practitioner",{"$f":"IF(I37=\"XXX\",\"XXX\",IF($F266=\"NA\",\"XXX\",SUM(I37*$F266)))","v":"XXX"}]
[null,"1",15,19,"Salaries-AfC1-Q28",{"$f":"IF(ISERROR(VLOOKUP(CONCATENATE(B267,\"-\",VLOOKUP(C267,afcterms_table,D267,FALSE)),'AfC Spine Data'!$R$4:$S$94,2,FALSE))=TRUE,\"NA\",VLOOKUP(CONCATENATE(B267,\"-\",VLOOKUP(C267,afcterms_table,D267,FALSE)),'AfC Spine Data'!$R$4:$S$94,2,FALSE))","v":22241.52},"CH-Salaries-AfC1-Q28","AfC 1 - Cytoscreeners",{"$f":"IF(I38=\"XXX\",\"XXX\",IF($F267=\"NA\",\"XXX\",SUM(I38*$F267)))","v":"XXX"}]
[null,"1",16,19,"Salaries-AfC1-Q14",{"$f":"IF(ISERROR(VLOOKUP(CONCATENATE(B268,\"-\",VLOOKUP(C268,afcterms_table,D268,FALSE)),'AfC Spine Data'!$R$4:$S$94,2,FALSE))=TRUE,\"NA\",VLOOKUP(CONCATENATE(B268,\"-\",VLOOKUP(C268,afcterms_table,D268,FALSE)),'AfC Spine Data'!$R$4:$S$94,2,FALSE))","v":22241.52},"CH-Salaries-AfC1-Q14","AfC 1 - Administrative and Clerical Staff",{"$f":"IF(I39=\"XXX\",\"XXX\",IF($F268=\"NA\",\"XXX\",SUM(I39*$F268)))","v":"XXX"}]
[null,"1",17,19,"Salaries-AfC1-Q15",{"$f":"IF(ISERROR(VLOOKUP(CONCATENATE(B269,\"-\",VLOOKUP(C269,afcterms_table,D269,FALSE)),'AfC Spine Data'!$R$4:$S$94,2,FALSE))=TRUE,\"NA\",VLOOKUP(CONCATENATE(B269,\"-\",VLOOKUP(C269,afcterms_table,D269,FALSE)),'AfC Spine Data'!$R$4:$S$94,2,FALSE))","v":22241.52},"CH-Salaries-AfC1-Q15","AfC 1 - Management Staff (Include Clinical Director, Finance Director, Lab Manager etc)",{"$f":"IF(I40=\"XXX\",\"XXX\",IF($F269=\"NA\",\"XXX\",SUM(I40*$F269)))","v":"XXX"}]
[null,"1",18,19,"Salaries-AfC1-Q16",{"$f":"IF(ISERROR(VLOOKUP(CONCATENATE(B270,\"-\",VLOOKUP(C270,afcterms_table,D270,FALSE)),'AfC Spine Data'!$R$4:$S$94,2,FALSE))=TRUE,\"NA\",VLOOKUP(CONCATENATE(B270,\"-\",VLOOKUP(C270,afcterms_table,D270,FALSE)),'AfC Spine Data'!$R$4:$S$94,2,FALSE))","v":22241.52},"CH-Salaries-AfC1-Q16","AfC 1 - Quality Managers",{"$f":"IF(I41=\"XXX\",\"XXX\",IF($F270=\"NA\",\"XXX\",SUM(I41*$F270)))","v":"XXX"}]
[null,"1",19,19,"Salaries-AfC1-Q17",{"$f":"IF(ISERROR(VLOOKUP(CONCATENATE(B271,\"-\",VLOOKUP(C271,afcterms_table,D271,FALSE)),'AfC Spine Data'!$R$4:$S$94,2,FALSE))=TRUE,\"NA\",VLOOKUP(CONCATENATE(B271,\"-\",VLOOKUP(C271,afcterms_table,D271,FALSE)),'AfC Spine Data'!$R$4:$S$94,2,FALSE))","v":22241.52},"CH-Salaries-AfC1-Q17","AfC 1 - IT Staff",{"$f":"IF(I42=\"XXX\",\"XXX\",IF($F271=\"NA\",\"XXX\",SUM(I42*$F271)))","v":"XXX"}]
[null,"1",20,19,"Salaries-AfC1-Q18",{"$f":"IF(ISERROR(VLOOKUP(CONCATENATE(B272,\"-\",VLOOKUP(C272,afcterms_table,D272,FALSE)),'AfC Spine Data'!$R$4:$S$94,2,FALSE))=TRUE,\"NA\",VLOOKUP(CONCATENATE(B272,\"-\",VLOOKUP(C272,afcterms_table,D272,FALSE)),'AfC Spine Data'!$R$4:$S$94,2,FALSE))","v":22241.52},"CH-Salaries-AfC1-Q18","AfC 1 - Remaning Other Staff",{"$f":"IF(I43=\"XXX\",\"XXX\",IF($F272=\"NA\",\"XXX\",SUM(I43*$F272)))","v":"XXX"}]
[null,"1",21,19,"Salaries-AfC1-Q20",{"$f":"IF(ISERROR(VLOOKUP(CONCATENATE(B273,\"-\",VLOOKUP(C273,afcterms_table,D273,FALSE)),'AfC Spine Data'!$R$4:$S$94,2,FALSE))=TRUE,\"NA\",VLOOKUP(CONCATENATE(B273,\"-\",VLOOKUP(C273,afcterms_table,D273,FALSE)),'AfC Spine Data'!$R$4:$S$94,2,FALSE))","v":"NA"},"CH-Salaries-AfC1-Q20","AfC 1 - Total",{"$f":"IF(SUM(I257,I258,I259,I260,I262,I263,I264,I265,I266,I267,I268,I269,I270,I271,I272)=0,\"XXX\",SUM(I257,I258,I259,I260,I262,I263,I264,I265,I266,I267,I268,I269,I270,I271,I272))","v":"XXX"}]
[null,"2",6,20,"Salaries-AfC2-Q1",{"$f":"IF(ISERROR(VLOOKUP(CONCATENATE(B274,\"-\",VLOOKUP(C274,afcterms_table,D274,FALSE)),'AfC Spine Data'!$R$4:$S$94,2,FALSE))=TRUE,\"NA\",VLOOKUP(CONCATENATE(B274,\"-\",VLOOKUP(C274,afcterms_table,D274,FALSE)),'AfC Spine Data'!$R$4:$S$94,2,FALSE))","v":22241.52},"CH-Salaries-AfC2-Q1","AfC 2 - Consultant Clinical Scientist",{"$f":"IF(I45=\"XXX\",\"XXX\",IF($F274=\"NA\",\"XXX\",SUM(I45*$F274)))","v":"XXX"}]
[null,"2",7,20,"Salaries-AfC2-Q2",{"$f":"IF(ISERROR(VLOOKUP(CONCATENATE(B275,\"-\",VLOOKUP(C275,afcterms_table,D275,FALSE)),'AfC Spine Data'!$R$4:$S$94,2,FALSE))=TRUE,\"NA\",VLOOKUP(CONCATENATE(B275,\"-\",VLOOKUP(C275,afcterms_table,D275,FALSE)),'AfC Spine Data'!$R$4:$S$94,2,FALSE))","v":22241.52},"CH-Salaries-AfC2-Q2","AfC 2 - Non-Trainee, Non-Consultant Clinical Scientist",{"$f":"IF(I46=\"XXX\",\"XXX\",IF($F275=\"NA\",\"XXX\",SUM(I46*$F275)))","v":"XXX"}]
[null,"2",8,20,"Salaries-AfC2-Q3",{"$f":"IF(ISERROR(VLOOKUP(CONCATENATE(B276,\"-\",VLOOKUP(C276,afcterms_table,D276,FALSE)),'AfC Spine Data'!$R$4:$S$94,2,FALSE))=TRUE,\"NA\",VLOOKUP(CONCATENATE(B276,\"-\",VLOOKUP(C276,afcterms_table,D276,FALSE)),'AfC Spine Data'!$R$4:$S$94,2,FALSE))","v":22241.52},"CH-Salaries-AfC2-Q3","AfC 2 - Trainee Clinical Scientist (eg STP) - Internally Funded",{"$f":"IF(I47=\"XXX\",\"XXX\",IF($F276=\"NA\",\"XXX\",SUM(I47*$F276*'AfC Spine Data'!$V$5)))","v":"XXX"}]
[null,"2",9,20,"Salaries-AfC2-Q4",{"$f":"IF(ISERROR(VLOOKUP(CONCATENATE(B277,\"-\",VLOOKUP(C277,afcterms_table,D277,FALSE)),'AfC Spine Data'!$R$4:$S$94,2,FALSE))=TRUE,\"NA\",VLOOKUP(CONCATENATE(B277,\"-\",VLOOKUP(C277,afcterms_table,D277,FALSE)),'AfC Spine Data'!$R$4:$S$94,2,FALSE))","v":22241.52},"CH-Salaries-AfC2-Q4","AfC 2 - Trainee Clinical Scientist (eg STP) - Externally Funded","XXX"]
[null,"2",null,20,"Salaries-AfC2-Q6",{"$f":"IF(ISERROR(VLOOKUP(CONCATENATE(B278,\"-\",VLOOKUP(C278,afcterms_table,D278,FALSE)),'AfC Spine Data'!$R$4:$S$94,2,FALSE))=TRUE,\"NA\",VLOOKUP(CONCATENATE(B278,\"-\",VLOOKUP(C278,afcterms_table,D278,FALSE)),'AfC Spine Data'!$R$4:$S$94,2,FALSE))","v":"NA"},"CH-Salaries-AfC2-Q6","AfC 2 - Consultant Biomedical Scientist",{"$f":"IF(I49=\"XXX\",\"XXX\",IF($F278=\"NA\",\"XXX\",SUM(I49*$F278)))","v":"XXX"}]
[null,"2",10,20,"Salaries-AfC2-Q7",{"$f":"IF(ISERROR(VLOOKUP(CONCATENATE(B279,\"-\",VLOOKUP(C279,afcterms_table,D279,FALSE)),'AfC Spine Data'!$R$4:$S$94,2,FALSE))=TRUE,\"NA\",VLOOKUP(CONCATENATE(B279,\"-\",VLOOKUP(C279,afcterms_table,D279,FALSE)),'AfC Spine Data'!$R$4:$S$94,2,FALSE))","v":22241.52},"CH-Salaries-AfC2-Q7","AfC 2 - Non Trainee Biomedical Scientist",{"$f":"IF(I50=\"XXX\",\"XXX\",IF($F279=\"NA\",\"XXX\",SUM(I50*$F279)))","v":"XXX"}]
[null,"2",11,20,"Salaries-AfC2-Q8",{"$f":"IF(ISERROR(VLOOKUP(CONCATENATE(B280,\"-\",VLOOKUP(C280,afcterms_table,D280,FALSE)),'AfC Spine Data'!$R$4:$S$94,2,FALSE))=TRUE,\"NA\",VLOOKUP(CONCATENATE(B280,\"-\",VLOOKUP(C280,afcterms_table,D280,FALSE)),'AfC Spine Data'!$R$4:$S$94,2,FALSE))","v":22241.52},"CH-Salaries-AfC2-Q8","AfC 2 - Trainee Biomedical Scientist - Internally Funded",{"$f":"IF(I51=\"XXX\",\"XXX\",IF($F280=\"NA\",\"XXX\",SUM(I51*$F280*'AfC Spine Data'!$V$6)))","v":"XXX"}]
[null,"2",12,20,"Salaries-AfC2-Q9",{"$f":"IF(ISERROR(VLOOKUP(CONCATENATE(B281,\"-\",VLOOKUP(C281,afcterms_table,D281,FALSE)),'AfC Spine Data'!$R$4:$S$94,2,FALSE))=TRUE,\"NA\",VLOOKUP(CONCATENATE(B281,\"-\",VLOOKUP(C281,afcterms_table,D281,FALSE)),'AfC Spine Data'!$R$4:$S$94,2,FALSE))","v":22241.52},"CH-Salaries-AfC2-Q9","AfC 2 - Trainee Biomedical Scientist - Externally Funded","XXX"]
[null,"2",13,20,"Salaries-AfC2-Q11",{"$f":"IF(ISERROR(VLOOKUP(CONCATENATE(B282,\"-\",VLOOKUP(C282,afcterms_table,D282,FALSE)),'AfC Spine Data'!$R$4:$S$94,2,FALSE))=TRUE,\"NA\",VLOOKUP(CONCATENATE(B282,\"-\",VLOOKUP(C282,afcterms_table,D282,FALSE)),'AfC Spine Data'!$R$4:$S$94,2,FALSE))","v":22241.52},"CH-Salaries-AfC2-Q11","AfC 2 - Laboratory Support Worker/Medical Laboratory Assistant (MLA)",{"$f":"IF(I53=\"XXX\",\"XXX\",IF($F282=\"NA\",\"XXX\",SUM(I53*$F282)))","v":"XXX"}]
[null,"2",14,20,"Salaries-AfC2-Q12",{"$f":"IF(ISERROR(VLOOKUP(CONCATENATE(B283,\"-\",VLOOKUP(C283,afcterms_table,D283,FALSE)),'AfC Spine Data'!$R$4:$S$94,2,FALSE))=TRUE,\"NA\",VLOOKUP(CONCATENATE(B283,\"-\",VLOOKUP(C283,afcterms_table,D283,FALSE)),'AfC Spine Data'!$R$4:$S$94,2,FALSE))","v":22241.52},"CH-Salaries-AfC2-Q12","AfC 2 - Associate Practitioner",{"$f":"IF(I54=\"XXX\",\"XXX\",IF($F283=\"NA\",\"XXX\",SUM(I54*$F283)))","v":"XXX"}]
[null,"2",15,20,"Salaries-AfC2-Q28",{"$f":"IF(ISERROR(VLOOKUP(CONCATENATE(B284,\"-\",VLOOKUP(C284,afcterms_table,D284,FALSE)),'AfC Spine Data'!$R$4:$S$94,2,FALSE))=TRUE,\"NA\",VLOOKUP(CONCATENATE(B284,\"-\",VLOOKUP(C284,afcterms_table,D284,FALSE)),'AfC Spine Data'!$R$4:$S$94,2,FALSE))","v":22241.52},"CH-Salaries-AfC2-Q28","AfC 2 - Cytoscreeners",{"$f":"IF(I55=\"XXX\",\"XXX\",IF($F284=\"NA\",\"XXX\",SUM(I55*$F284)))","v":"XXX"}]
[null,"2",16,20,"Salaries-AfC2-Q14",{"$f":"IF(ISERROR(VLOOKUP(CONCATENATE(B285,\"-\",VLOOKUP(C285,afcterms_table,D285,FALSE)),'AfC Spine Data'!$R$4:$S$94,2,FALSE))=TRUE,\"NA\",VLOOKUP(CONCATENATE(B285,\"-\",VLOOKUP(C285,afcterms_table,D285,FALSE)),'AfC Spine Data'!$R$4:$S$94,2,FALSE))","v":22241.52},"CH-Salaries-AfC2-Q14","AfC 2 - Administrative and Clerical Staff",{"$f":"IF(I56=\"XXX\",\"XXX\",IF($F285=\"NA\",\"XXX\",SUM(I56*$F285)))","v":"XXX"}]
[null,"2",17,20,"Salaries-AfC2-Q15",{"$f":"IF(ISERROR(VLOOKUP(CONCATENATE(B286,\"-\",VLOOKUP(C286,afcterms_table,D286,FALSE)),'AfC Spine Data'!$R$4:$S$94,2,FALSE))=TRUE,\"NA\",VLOOKUP(CONCATENATE(B286,\"-\",VLOOKUP(C286,afcterms_table,D286,FALSE)),'AfC Spine Data'!$R$4:$S$94,2,FALSE))","v":22241.52},"CH-Salaries-AfC2-Q15","AfC 2 - Management Staff (Include Clinical Director, Finance Director, Lab Manager etc)",{"$f":"IF(I57=\"XXX\",\"XXX\",IF($F286=\"NA\",\"XXX\",SUM(I57*$F286)))","v":"XXX"}]
[null,"2",18,20,"Salaries-AfC2-Q16",{"$f":"IF(ISERROR(VLOOKUP(CONCATENATE(B287,\"-\",VLOOKUP(C287,afcterms_table,D287,FALSE)),'AfC Spine Data'!$R$4:$S$94,2,FALSE))=TRUE,\"NA\",VLOOKUP(CONCATENATE(B287,\"-\",VLOOKUP(C287,afcterms_table,D287,FALSE)),'AfC Spine Data'!$R$4:$S$94,2,FALSE))","v":22241.52},"CH-Salaries-AfC2-Q16","AfC 2 - Quality Managers",{"$f":"IF(I58=\"XXX\",\"XXX\",IF($F287=\"NA\",\"XXX\",SUM(I58*$F287)))","v":"XXX"}]
[null,"2",19,20,"Salaries-AfC2-Q17",{"$f":"IF(ISERROR(VLOOKUP(CONCATENATE(B288,\"-\",VLOOKUP(C288,afcterms_table,D288,FALSE)),'AfC Spine Data'!$R$4:$S$94,2,FALSE))=TRUE,\"NA\",VLOOKUP(CONCATENATE(B288,\"-\",VLOOKUP(C288,afcterms_table,D288,FALSE)),'AfC Spine Data'!$R$4:$S$94,2,FALSE))","v":22241.52},"CH-Salaries-AfC2-Q17","AfC 2 - IT Staff",{"$f":"IF(I59=\"XXX\",\"XXX\",IF($F288=\"NA\",\"XXX\",SUM(I59*$F288)))","v":"XXX"}]
[null,"2",20,20,"Salaries-AfC2-Q18",{"$f":"IF(ISERROR(VLOOKUP(CONCATENATE(B289,\"-\",VLOOKUP(C289,afcterms_table,D289,FALSE)),'AfC Spine Data'!$R$4:$S$94,2,FALSE))=TRUE,\"NA\",VLOOKUP(CONCATENATE(B289,\"-\",VLOOKUP(C289,afcterms_table,D289,FALSE)),'AfC Spine Data'!$R$4:$S$94,2,FALSE))","v":22241.52},"CH-Salaries-AfC2-Q18","AfC 2 - Remaning Other Staff",{"$f":"IF(I60=\"XXX\",\"XXX\",IF($F289=\"NA\",\"XXX\",SUM(I60*$F289)))","v":"XXX"}]
[null,"2",21,20,"Salaries-AfC2-Q20",{"$f":"IF(ISERROR(VLOOKUP(CONCATENATE(B290,\"-\",VLOOKUP(C290,afcterms_table,D290,FALSE)),'AfC Spine Data'!$R$4:$S$94,2,FALSE))=TRUE,\"NA\",VLOOKUP(CONCATENATE(B290,\"-\",VLOOKUP(C290,afcterms_table,D290,FALSE)),'AfC Spine Data'!$R$4:$S$94,2,FALSE))","v":"NA"},"CH-Salaries-AfC2-Q20","AfC 2 - Total",{"$f":"IF(SUM(I274,I275,I276,I277,I279,I280,I281,I282,I283,I284,I285,I286,I287,I288,I289)=0,\"XXX\",SUM(I274,I275,I276,I277,I279,I280,I281,I282,I283,I284,I285,I286,I287,I288,I289))","v":"XXX"}]
[null,"3",6,20,"Salaries-AfC3-Q1",{"$f":"IF(ISERROR(VLOOKUP(CONCATENATE(B291,\"-\",VLOOKUP(C291,afcterms_table,D291,FALSE)),'AfC Spine Data'!$R$4:$S$94,2,FALSE))=TRUE,\"NA\",VLOOKUP(CONCATENATE(B291,\"-\",VLOOKUP(C291,afcterms_table,D291,FALSE)),'AfC Spine Data'!$R$4:$S$94,2,FALSE))","v":23704.38},"CH-Salaries-AfC3-Q1","AfC 3 - Consultant Clinical Scientist",{"$f":"IF(I62=\"XXX\",\"XXX\",IF($F291=\"NA\",\"XXX\",SUM(I62*$F291)))","v":"XXX"}]
[null,"3",7,20,"Salaries-AfC3-Q2",{"$f":"IF(ISERROR(VLOOKUP(CONCATENATE(B292,\"-\",VLOOKUP(C292,afcterms_table,D292,FALSE)),'AfC Spine Data'!$R$4:$S$94,2,FALSE))=TRUE,\"NA\",VLOOKUP(CONCATENATE(B292,\"-\",VLOOKUP(C292,afcterms_table,D292,FALSE)),'AfC Spine Data'!$R$4:$S$94,2,FALSE))","v":23704.38},"CH-Salaries-AfC3-Q2","AfC 3 - Non-Trainee, Non-Consultant Clinical Scientist",{"$f":"IF(I63=\"XXX\",\"XXX\",IF($F292=\"NA\",\"XXX\",SUM(I63*$F292)))","v":"XXX"}]
[null,"3",8,20,"Salaries-AfC3-Q3",{"$f":"IF(ISERROR(VLOOKUP(CONCATENATE(B293,\"-\",VLOOKUP(C293,afcterms_table,D293,FALSE)),'AfC Spine Data'!$R$4:$S$94,2,FALSE))=TRUE,\"NA\",VLOOKUP(CONCATENATE(B293,\"-\",VLOOKUP(C293,afcterms_table,D293,FALSE)),'AfC Spine Data'!$R$4:$S$94,2,FALSE))","v":23704.38},"CH-Salaries-AfC3-Q3","AfC 3 - Trainee Clinical Scientist (eg STP) - Internally Funded",{"$f":"IF(I64=\"XXX\",\"XXX\",IF($F293=\"NA\",\"XXX\",SUM(I64*$F293*'AfC Spine Data'!$V$5)))","v":"XXX"}]
[null,"3",9,20,"Salaries-AfC3-Q4",{"$f":"IF(ISERROR(VLOOKUP(CONCATENATE(B294,\"-\",VLOOKUP(C294,afcterms_table,D294,FALSE)),'AfC Spine Data'!$R$4:$S$94,2,FALSE))=TRUE,\"NA\",VLOOKUP(CONCATENATE(B294,\"-\",VLOOKUP(C294,afcterms_table,D294,FALSE)),'AfC Spine Data'!$R$4:$S$94,2,FALSE))","v":23704.38},"CH-Salaries-AfC3-Q4","AfC 3 - Trainee Clinical Scientist (eg STP) - Externally Funded","XXX"]
[null,"3",null,20,"Salaries-AfC3-Q6",{"$f":"IF(ISERROR(VLOOKUP(CONCATENATE(B295,\"-\",VLOOKUP(C295,afcterms_table,D295,FALSE)),'AfC Spine Data'!$R$4:$S$94,2,FALSE))=TRUE,\"NA\",VLOOKUP(CONCATENATE(B295,\"-\",VLOOKUP(C295,afcterms_table,D295,FALSE)),'AfC Spine Data'!$R$4:$S$94,2,FALSE))","v":"NA"},"CH-Salaries-AfC3-Q6","AfC 3 - Consultant Biomedical Scientist",{"$f":"IF(I66=\"XXX\",\"XXX\",IF($F295=\"NA\",\"XXX\",SUM(I66*$F295)))","v":"XXX"}]
[null,"3",10,20,"Salaries-AfC3-Q7",{"$f":"IF(ISERROR(VLOOKUP(CONCATENATE(B296,\"-\",VLOOKUP(C296,afcterms_table,D296,FALSE)),'AfC Spine Data'!$R$4:$S$94,2,FALSE))=TRUE,\"NA\",VLOOKUP(CONCATENATE(B296,\"-\",VLOOKUP(C296,afcterms_table,D296,FALSE)),'AfC Spine Data'!$R$4:$S$94,2,FALSE))","v":23704.38},"CH-Salaries-AfC3-Q7","AfC 3 - Non Trainee Biomedical Scientist",{"$f":"IF(I67=\"XXX\",\"XXX\",IF($F296=\"NA\",\"XXX\",SUM(I67*$F296)))","v":"XXX"}]
[null,"3",11,20,"Salaries-AfC3-Q8",{"$f":"IF(ISERROR(VLOOKUP(CONCATENATE(B297,\"-\",VLOOKUP(C297,afcterms_table,D297,FALSE)),'AfC Spine Data'!$R$4:$S$94,2,FALSE))=TRUE,\"NA\",VLOOKUP(CONCATENATE(B297,\"-\",VLOOKUP(C297,afcterms_table,D297,FALSE)),'AfC Spine Data'!$R$4:$S$94,2,FALSE))","v":23704.38},"CH-Salaries-AfC3-Q8","AfC 3 - Trainee Biomedical Scientist - Internally Funded",{"$f":"IF(I68=\"XXX\",\"XXX\",IF($F297=\"NA\",\"XXX\",SUM(I68*$F297*'AfC Spine Data'!$V$6)))","v":"XXX"}]
[null,"3",12,20,"Salaries-AfC3-Q9",{"$f":"IF(ISERROR(VLOOKUP(CONCATENATE(B298,\"-\",VLOOKUP(C298,afcterms_table,D298,FALSE)),'AfC Spine Data'!$R$4:$S$94,2,FALSE))=TRUE,\"NA\",VLOOKUP(CONCATENATE(B298,\"-\",VLOOKUP(C298,afcterms_table,D298,FALSE)),'AfC Spine Data'!$R$4:$S$94,2,FALSE))","v":23704.38},"CH-Salaries-AfC3-Q9","AfC 3 - Trainee Biomedical Scientist - Externally Funded","XXX"]
[null,"3",13,20,"Salaries-AfC3-Q11",{"$f":"IF(ISERROR(VLOOKUP(CONCATENATE(B299,\"-\",VLOOKUP(C299,afcterms_table,D299,FALSE)),'AfC Spine Data'!$R$4:$S$94,2,FALSE))=TRUE,\"NA\",VLOOKUP(CONCATENATE(B299,\"-\",VLOOKUP(C299,afcterms_table,D299,FALSE)),'AfC Spine Data'!$R$4:$S$94,2,FALSE))","v":23704.38},{"$f":"CONCATENATE($F$2,\"-\",E299)","v":"CH-Salaries-AfC3-Q11"},"AfC 3 - Laboratory Support Worker/Medical Laboratory Assistant (MLA)",{"$f":"IF(I70=\"XXX\",\"XXX\",IF($F299=\"NA\",\"XXX\",SUM(I70*$F299)))","v":"XXX"}]
[null,"3",14,20,"Salaries-AfC3-Q12",{"$f":"IF(ISERROR(VLOOKUP(CONCATENATE(B300,\"-\",VLOOKUP(C300,afcterms_table,D300,FALSE)),'AfC Spine Data'!$R$4:$S$94,2,FALSE))=TRUE,\"NA\",VLOOKUP(CONCATENATE(B300,\"-\",VLOOKUP(C300,afcterms_table,D300,FALSE)),'AfC Spine Data'!$R$4:$S$94,2,FALSE))","v":23704.38},"CH-Salaries-AfC3-Q12","AfC 3 - Associate Practitioner",{"$f":"IF(I71=\"XXX\",\"XXX\",IF($F300=\"NA\",\"XXX\",SUM(I71*$F300)))","v":"XXX"}]
[null,"3",15,20,"Salaries-AfC3-Q28",{"$f":"IF(ISERROR(VLOOKUP(CONCATENATE(B301,\"-\",VLOOKUP(C301,afcterms_table,D301,FALSE)),'AfC Spine Data'!$R$4:$S$94,2,FALSE))=TRUE,\"NA\",VLOOKUP(CONCATENATE(B301,\"-\",VLOOKUP(C301,afcterms_table,D301,FALSE)),'AfC Spine Data'!$R$4:$S$94,2,FALSE))","v":23704.38},"CH-Salaries-AfC3-Q28","AfC 3 - Cytoscreeners",{"$f":"IF(I72=\"XXX\",\"XXX\",IF($F301=\"NA\",\"XXX\",SUM(I72*$F301)))","v":"XXX"}]
[null,"3",16,20,"Salaries-AfC3-Q14",{"$f":"IF(ISERROR(VLOOKUP(CONCATENATE(B302,\"-\",VLOOKUP(C302,afcterms_table,D302,FALSE)),'AfC Spine Data'!$R$4:$S$94,2,FALSE))=TRUE,\"NA\",VLOOKUP(CONCATENATE(B302,\"-\",VLOOKUP(C302,afcterms_table,D302,FALSE)),'AfC Spine Data'!$R$4:$S$94,2,FALSE))","v":23704.38},"CH-Salaries-AfC3-Q14","AfC 3 - Administrative and Clerical Staff",{"$f":"IF(I73=\"XXX\",\"XXX\",IF($F302=\"NA\",\"XXX\",SUM(I73*$F302)))","v":"XXX"}]
[null,"3",17,20,"Salaries-AfC3-Q15",{"$f":"IF(ISERROR(VLOOKUP(CONCATENATE(B303,\"-\",VLOOKUP(C303,afcterms_table,D303,FALSE)),'AfC Spine Data'!$R$4:$S$94,2,FALSE))=TRUE,\"NA\",VLOOKUP(CONCATENATE(B303,\"-\",VLOOKUP(C303,afcterms_table,D303,FALSE)),'AfC Spine Data'!$R$4:$S$94,2,FALSE))","v":23704.38},"CH-Salaries-AfC3-Q15","AfC 3 - Management Staff (Include Clinical Director, Finance Director, Lab Manager etc)",{"$f":"IF(I74=\"XXX\",\"XXX\",IF($F303=\"NA\",\"XXX\",SUM(I74*$F303)))","v":"XXX"}]
[null,"3",18,20,"Salaries-AfC3-Q16",{"$f":"IF(ISERROR(VLOOKUP(CONCATENATE(B304,\"-\",VLOOKUP(C304,afcterms_table,D304,FALSE)),'AfC Spine Data'!$R$4:$S$94,2,FALSE))=TRUE,\"NA\",VLOOKUP(CONCATENATE(B304,\"-\",VLOOKUP(C304,afcterms_table,D304,FALSE)),'AfC Spine Data'!$R$4:$S$94,2,FALSE))","v":23704.38},"CH-Salaries-AfC3-Q16","AfC 3 - Quality Managers",{"$f":"IF(I75=\"XXX\",\"XXX\",IF($F304=\"NA\",\"XXX\",SUM(I75*$F304)))","v":"XXX"}]
[null,"3",19,20,"Salaries-AfC3-Q17",{"$f":"IF(ISERROR(VLOOKUP(CONCATENATE(B305,\"-\",VLOOKUP(C305,afcterms_table,D305,FALSE)),'AfC Spine Data'!$R$4:$S$94,2,FALSE))=TRUE,\"NA\",VLOOKUP(CONCATENATE(B305,\"-\",VLOOKUP(C305,afcterms_table,D305,FALSE)),'AfC Spine Data'!$R$4:$S$94,2,FALSE))","v":23704.38},"CH-Salaries-AfC3-Q17","AfC 3 - IT Staff",{"$f":"IF(I76=\"XXX\",\"XXX\",IF($F305=\"NA\",\"XXX\",SUM(I76*$F305)))","v":"XXX"}]
[null,"3",20,20,"Salaries-AfC3-Q18",{"$f":"IF(ISERROR(VLOOKUP(CONCATENATE(B306,\"-\",VLOOKUP(C306,afcterms_table,D306,FALSE)),'AfC Spine Data'!$R$4:$S$94,2,FALSE))=TRUE,\"NA\",VLOOKUP(CONCATENATE(B306,\"-\",VLOOKUP(C306,afcterms_table,D306,FALSE)),'AfC Spine Data'!$R$4:$S$94,2,FALSE))","v":23704.38},"CH-Salaries-AfC3-Q18","AfC 3 - Remaning Other Staff",{"$f":"IF(I77=\"XXX\",\"XXX\",IF($F306=\"NA\",\"XXX\",SUM(I77*$F306)))","v":"XXX"}]
[null,"3",21,20,"Salaries-AfC3-Q20",{"$f":"IF(ISERROR(VLOOKUP(CONCATENATE(B307,\"-\",VLOOKUP(C307,afcterms_table,D307,FALSE)),'AfC Spine Data'!$R$4:$S$94,2,FALSE))=TRUE,\"NA\",VLOOKUP(CONCATENATE(B307,\"-\",VLOOKUP(C307,afcterms_table,D307,FALSE)),'AfC Spine Data'!$R$4:$S$94,2,FALSE))","v":"NA"},"CH-Salaries-AfC3-Q20","AfC 3 - Total",{"$f":"IF(SUM(I291,I292,I293,I294,I296,I297,I298,I299,I300,I301,I302,I303,I304,I305,I306)=0,\"XXX\",SUM(I291,I292,I293,I294,I296,I297,I298,I299,I300,I301,I302,I303,I304,I305,I306))","v":"XXX"}]
[null,"4",6,20,"Salaries-AfC4-Q1",{"$f":"IF(ISERROR(VLOOKUP(CONCATENATE(B308,\"-\",VLOOKUP(C308,afcterms_table,D308,FALSE)),'AfC Spine Data'!$R$4:$S$94,2,FALSE))=TRUE,\"NA\",VLOOKUP(CONCATENATE(B308,\"-\",VLOOKUP(C308,afcterms_table,D308,FALSE)),'AfC Spine Data'!$R$4:$S$94,2,FALSE))","v":27491.940000000002},"CH-Salaries-AfC4-Q1","AfC 4 - Consultant Clinical Scientist",{"$f":"IF(I79=\"XXX\",\"XXX\",IF($F308=\"NA\",\"XXX\",SUM(I79*$F308)))","v":"XXX"}]
[null,"4",7,20,"Salaries-AfC4-Q2",{"$f":"IF(ISERROR(VLOOKUP(CONCATENATE(B309,\"-\",VLOOKUP(C309,afcterms_table,D309,FALSE)),'AfC Spine Data'!$R$4:$S$94,2,FALSE))=TRUE,\"NA\",VLOOKUP(CONCATENATE(B309,\"-\",VLOOKUP(C309,afcterms_table,D309,FALSE)),'AfC Spine Data'!$R$4:$S$94,2,FALSE))","v":27491.940000000002},"CH-Salaries-AfC4-Q2","AfC 4 - Non-Trainee, Non-Consultant Clinical Scientist",{"$f":"IF(I80=\"XXX\",\"XXX\",IF($F309=\"NA\",\"XXX\",SUM(I80*$F309)))","v":"XXX"}]
[null,"4",8,20,"Salaries-AfC4-Q3",{"$f":"IF(ISERROR(VLOOKUP(CONCATENATE(B310,\"-\",VLOOKUP(C310,afcterms_table,D310,FALSE)),'AfC Spine Data'!$R$4:$S$94,2,FALSE))=TRUE,\"NA\",VLOOKUP(CONCATENATE(B310,\"-\",VLOOKUP(C310,afcterms_table,D310,FALSE)),'AfC Spine Data'!$R$4:$S$94,2,FALSE))","v":27491.940000000002},"CH-Salaries-AfC4-Q3","AfC 4 - Trainee Clinical Scientist (eg STP) - Internally Funded",{"$f":"IF(I81=\"XXX\",\"XXX\",IF($F310=\"NA\",\"XXX\",SUM(I81*$F310*'AfC Spine Data'!$V$5)))","v":"XXX"}]
[null,"4",9,20,"Salaries-AfC4-Q4",{"$f":"IF(ISERROR(VLOOKUP(CONCATENATE(B311,\"-\",VLOOKUP(C311,afcterms_table,D311,FALSE)),'AfC Spine Data'!$R$4:$S$94,2,FALSE))=TRUE,\"NA\",VLOOKUP(CONCATENATE(B311,\"-\",VLOOKUP(C311,afcterms_table,D311,FALSE)),'AfC Spine Data'!$R$4:$S$94,2,FALSE))","v":27491.940000000002},"CH-Salaries-AfC4-Q4","AfC 4 - Trainee Clinical Scientist (eg STP) - Externally Funded","XXX"]
[null,"4",null,20,"Salaries-AfC4-Q6",{"$f":"IF(ISERROR(VLOOKUP(CONCATENATE(B312,\"-\",VLOOKUP(C312,afcterms_table,D312,FALSE)),'AfC Spine Data'!$R$4:$S$94,2,FALSE))=TRUE,\"NA\",VLOOKUP(CONCATENATE(B312,\"-\",VLOOKUP(C312,afcterms_table,D312,FALSE)),'AfC Spine Data'!$R$4:$S$94,2,FALSE))","v":"NA"},"CH-Salaries-AfC4-Q6","AfC 4 - Consultant Biomedical Scientist",{"$f":"IF(I83=\"XXX\",\"XXX\",IF($F312=\"NA\",\"XXX\",SUM(I83*$F312)))","v":"XXX"}]
[null,"4",10,20,"Salaries-AfC4-Q7",{"$f":"IF(ISERROR(VLOOKUP(CONCATENATE(B313,\"-\",VLOOKUP(C313,afcterms_table,D313,FALSE)),'AfC Spine Data'!$R$4:$S$94,2,FALSE))=TRUE,\"NA\",VLOOKUP(CONCATENATE(B313,\"-\",VLOOKUP(C313,afcterms_table,D313,FALSE)),'AfC Spine Data'!$R$4:$S$94,2,FALSE))","v":27491.940000000002},"CH-Salaries-AfC4-Q7","AfC 4 - Non Trainee Biomedical Scientist",{"$f":"IF(I84=\"XXX\",\"XXX\",IF($F313=\"NA\",\"XXX\",SUM(I84*$F313)))","v":"XXX"}]
[null,"4",11,20,"Salaries-AfC4-Q8",{"$f":"IF(ISERROR(VLOOKUP(CONCATENATE(B314,\"-\",VLOOKUP(C314,afcterms_table,D314,FALSE)),'AfC Spine Data'!$R$4:$S$94,2,FALSE))=TRUE,\"NA\",VLOOKUP(CONCATENATE(B314,\"-\",VLOOKUP(C314,afcterms_table,D314,FALSE)),'AfC Spine Data'!$R$4:$S$94,2,FALSE))","v":27491.940000000002},"CH-Salaries-AfC4-Q8","AfC 4 - Trainee Biomedical Scientist - Internally Funded",{"$f":"IF(I85=\"XXX\",\"XXX\",IF($F314=\"NA\",\"XXX\",SUM(I85*$F314*'AfC Spine Data'!$V$6)))","v":"XXX"}]
[null,"4",12,20,"Salaries-AfC4-Q9",{"$f":"IF(ISERROR(VLOOKUP(CONCATENATE(B315,\"-\",VLOOKUP(C315,afcterms_table,D315,FALSE)),'AfC Spine Data'!$R$4:$S$94,2,FALSE))=TRUE,\"NA\",VLOOKUP(CONCATENATE(B315,\"-\",VLOOKUP(C315,afcterms_table,D315,FALSE)),'AfC Spine Data'!$R$4:$S$94,2,FALSE))","v":27491.940000000002},"CH-Salaries-AfC4-Q9","AfC 4 - Trainee Biomedical Scientist - Externally Funded","XXX"]
[null,"4",13,20,"Salaries-AfC4-Q11",{"$f":"IF(ISERROR(VLOOKUP(CONCATENATE(B316,\"-\",VLOOKUP(C316,afcterms_table,D316,FALSE)),'AfC Spine Data'!$R$4:$S$94,2,FALSE))=TRUE,\"NA\",VLOOKUP(CONCATENATE(B316,\"-\",VLOOKUP(C316,afcterms_table,D316,FALSE)),'AfC Spine Data'!$R$4:$S$94,2,FALSE))","v":27491.940000000002},"CH-Salaries-AfC4-Q11","AfC 4 - Laboratory Support Worker/Medical Laboratory Assistant (MLA)",{"$f":"IF(I87=\"XXX\",\"XXX\",IF($F316=\"NA\",\"XXX\",SUM(I87*$F316)))","v":"XXX"}]
[null,"4",14,20,"Salaries-AfC4-Q12",{"$f":"IF(ISERROR(VLOOKUP(CONCATENATE(B317,\"-\",VLOOKUP(C317,afcterms_table,D317,FALSE)),'AfC Spine Data'!$R$4:$S$94,2,FALSE))=TRUE,\"NA\",VLOOKUP(CONCATENATE(B317,\"-\",VLOOKUP(C317,afcterms_table,D317,FALSE)),'AfC Spine Data'!$R$4:$S$94,2,FALSE))","v":27491.940000000002},"CH-Salaries-AfC4-Q12","AfC 4 - Associate Practitioner",{"$f":"IF(I88=\"XXX\",\"XXX\",IF($F317=\"NA\",\"XXX\",SUM(I88*$F317)))","v":"XXX"}]
[null,"4",15,20,"Salaries-AfC4-Q28",{"$f":"IF(ISERROR(VLOOKUP(CONCATENATE(B318,\"-\",VLOOKUP(C318,afcterms_table,D318,FALSE)),'AfC Spine Data'!$R$4:$S$94,2,FALSE))=TRUE,\"NA\",VLOOKUP(CONCATENATE(B318,\"-\",VLOOKUP(C318,afcterms_table,D318,FALSE)),'AfC Spine Data'!$R$4:$S$94,2,FALSE))","v":27491.940000000002},"CH-Salaries-AfC4-Q28","AfC 4 - Cytoscreeners",{"$f":"IF(I89=\"XXX\",\"XXX\",IF($F318=\"NA\",\"XXX\",SUM(I89*$F318)))","v":"XXX"}]
[null,"4",16,20,"Salaries-AfC4-Q14",{"$f":"IF(ISERROR(VLOOKUP(CONCATENATE(B319,\"-\",VLOOKUP(C319,afcterms_table,D319,FALSE)),'AfC Spine Data'!$R$4:$S$94,2,FALSE))=TRUE,\"NA\",VLOOKUP(CONCATENATE(B319,\"-\",VLOOKUP(C319,afcterms_table,D319,FALSE)),'AfC Spine Data'!$R$4:$S$94,2,FALSE))","v":27491.940000000002},"CH-Salaries-AfC4-Q14","AfC 4 - Administrative and Clerical Staff",{"$f":"IF(I90=\"XXX\",\"XXX\",IF($F319=\"NA\",\"XXX\",SUM(I90*$F319)))","v":"XXX"}]
[null,"4",17,20,"Salaries-AfC4-Q15",{"$f":"IF(ISERROR(VLOOKUP(CONCATENATE(B320,\"-\",VLOOKUP(C320,afcterms_table,D320,FALSE)),'AfC Spine Data'!$R$4:$S$94,2,FALSE))=TRUE,\"NA\",VLOOKUP(CONCATENATE(B320,\"-\",VLOOKUP(C320,afcterms_table,D320,FALSE)),'AfC Spine Data'!$R$4:$S$94,2,FALSE))","v":27491.940000000002},"CH-Salaries-AfC4-Q15","AfC 4 - Management Staff (Include Clinical Director, Finance Director, Lab Manager etc)",{"$f":"IF(I91=\"XXX\",\"XXX\",IF($F320=\"NA\",\"XXX\",SUM(I91*$F320)))","v":"XXX"}]
[null,"4",18,20,"Salaries-AfC4-Q16",{"$f":"IF(ISERROR(VLOOKUP(CONCATENATE(B321,\"-\",VLOOKUP(C321,afcterms_table,D321,FALSE)),'AfC Spine Data'!$R$4:$S$94,2,FALSE))=TRUE,\"NA\",VLOOKUP(CONCATENATE(B321,\"-\",VLOOKUP(C321,afcterms_table,D321,FALSE)),'AfC Spine Data'!$R$4:$S$94,2,FALSE))","v":27491.940000000002},"CH-Salaries-AfC4-Q16","AfC 4 - Quality Managers",{"$f":"IF(I92=\"XXX\",\"XXX\",IF($F321=\"NA\",\"XXX\",SUM(I92*$F321)))","v":"XXX"}]
[null,"4",19,20,"Salaries-AfC4-Q17",{"$f":"IF(ISERROR(VLOOKUP(CONCATENATE(B322,\"-\",VLOOKUP(C322,afcterms_table,D322,FALSE)),'AfC Spine Data'!$R$4:$S$94,2,FALSE))=TRUE,\"NA\",VLOOKUP(CONCATENATE(B322,\"-\",VLOOKUP(C322,afcterms_table,D322,FALSE)),'AfC Spine Data'!$R$4:$S$94,2,FALSE))","v":27491.940000000002},"CH-Salaries-AfC4-Q17","AfC 4 - IT Staff",{"$f":"IF(I93=\"XXX\",\"XXX\",IF($F322=\"NA\",\"XXX\",SUM(I93*$F322)))","v":"XXX"}]
[null,"4",20,20,"Salaries-AfC4-Q18",{"$f":"IF(ISERROR(VLOOKUP(CONCATENATE(B323,\"-\",VLOOKUP(C323,afcterms_table,D323,FALSE)),'AfC Spine Data'!$R$4:$S$94,2,FALSE))=TRUE,\"NA\",VLOOKUP(CONCATENATE(B323,\"-\",VLOOKUP(C323,afcterms_table,D323,FALSE)),'AfC Spine Data'!$R$4:$S$94,2,FALSE))","v":27491.940000000002},"CH-Salaries-AfC4-Q18","AfC 4 - Remaning Other Staff",{"$f":"IF(I94=\"XXX\",\"XXX\",IF($F323=\"NA\",\"XXX\",SUM(I94*$F323)))","v":"XXX"}]
[null,"4",21,20,"Salaries-AfC4-Q20",{"$f":"IF(ISERROR(VLOOKUP(CONCATENATE(B324,\"-\",VLOOKUP(C324,afcterms_table,D324,FALSE)),'AfC Spine Data'!$R$4:$S$94,2,FALSE))=TRUE,\"NA\",VLOOKUP(CONCATENATE(B324,\"-\",VLOOKUP(C324,afcterms_table,D324,FALSE)),'AfC Spine Data'!$R$4:$S$94,2,FALSE))","v":"NA"},"CH-Salaries-AfC4-Q20","AfC 4 - Total",{"$f":"IF(SUM(I308,I309,I310,I311,I313,I314,I315,I316,I317,I318,I319,I320,I321,I322,I323)=0,\"XXX\",SUM(I308,I309,I310,I311,I313,I314,I315,I316,I317,I318,I319,I320,I321,I322,I323))","v":"XXX"}]
[null,"5",6,21,"Salaries-AfC5-Q1",{"$f":"IF(ISERROR(VLOOKUP(CONCATENATE(B325,\"-\",VLOOKUP(C325,afcterms_table,D325,FALSE)),'AfC Spine Data'!$R$4:$S$94,2,FALSE))=TRUE,\"NA\",VLOOKUP(CONCATENATE(B325,\"-\",VLOOKUP(C325,afcterms_table,D325,FALSE)),'AfC Spine Data'!$R$4:$S$94,2,FALSE))","v":33037.199999999997},"CH-Salaries-AfC5-Q1","AfC 5 - Consultant Clinical Scientist",{"$f":"IF(I96=\"XXX\",\"XXX\",IF($F325=\"NA\",\"XXX\",SUM(I96*$F325)))","v":"XXX"}]
[null,"5",7,21,"Salaries-AfC5-Q2",{"$f":"IF(ISERROR(VLOOKUP(CONCATENATE(B326,\"-\",VLOOKUP(C326,afcterms_table,D326,FALSE)),'AfC Spine Data'!$R$4:$S$94,2,FALSE))=TRUE,\"NA\",VLOOKUP(CONCATENATE(B326,\"-\",VLOOKUP(C326,afcterms_table,D326,FALSE)),'AfC Spine Data'!$R$4:$S$94,2,FALSE))","v":33037.199999999997},"CH-Salaries-AfC5-Q2","AfC 5 - Non-Trainee, Non-Consultant Clinical Scientist",{"$f":"IF(I97=\"XXX\",\"XXX\",IF($F326=\"NA\",\"XXX\",SUM(I97*$F326)))","v":"XXX"}]
[null,"5",8,21,"Salaries-AfC5-Q3",{"$f":"IF(ISERROR(VLOOKUP(CONCATENATE(B327,\"-\",VLOOKUP(C327,afcterms_table,D327,FALSE)),'AfC Spine Data'!$R$4:$S$94,2,FALSE))=TRUE,\"NA\",VLOOKUP(CONCATENATE(B327,\"-\",VLOOKUP(C327,afcterms_table,D327,FALSE)),'AfC Spine Data'!$R$4:$S$94,2,FALSE))","v":33037.199999999997},"CH-Salaries-AfC5-Q3","AfC 5 - Trainee Clinical Scientist (eg STP) - Internally Funded",{"$f":"IF(I98=\"XXX\",\"XXX\",IF($F327=\"NA\",\"XXX\",SUM(I98*$F327*'AfC Spine Data'!$V$5)))","v":"XXX"}]
[null,"5",9,21,"Salaries-AfC5-Q4",{"$f":"IF(ISERROR(VLOOKUP(CONCATENATE(B328,\"-\",VLOOKUP(C328,afcterms_table,D328,FALSE)),'AfC Spine Data'!$R$4:$S$94,2,FALSE))=TRUE,\"NA\",VLOOKUP(CONCATENATE(B328,\"-\",VLOOKUP(C328,afcterms_table,D328,FALSE)),'AfC Spine Data'!$R$4:$S$94,2,FALSE))","v":33037.199999999997},"CH-Salaries-AfC5-Q4","AfC 5 - Trainee Clinical Scientist (eg STP) - Externally Funded","XXX"]
[null,"5",null,21,"Salaries-AfC5-Q6",{"$f":"IF(ISERROR(VLOOKUP(CONCATENATE(B329,\"-\",VLOOKUP(C329,afcterms_table,D329,FALSE)),'AfC Spine Data'!$R$4:$S$94,2,FALSE))=TRUE,\"NA\",VLOOKUP(CONCATENATE(B329,\"-\",VLOOKUP(C329,afcterms_table,D329,FALSE)),'AfC Spine Data'!$R$4:$S$94,2,FALSE))","v":"NA"},"CH-Salaries-AfC5-Q6","AfC 5 - Consultant Biomedical Scientist",{"$f":"IF(I100=\"XXX\",\"XXX\",IF($F329=\"NA\",\"XXX\",SUM(I100*$F329)))","v":"XXX"}]
[null,"5",10,21,"Salaries-AfC5-Q7",{"$f":"IF(ISERROR(VLOOKUP(CONCATENATE(B330,\"-\",VLOOKUP(C330,afcterms_table,D330,FALSE)),'AfC Spine Data'!$R$4:$S$94,2,FALSE))=TRUE,\"NA\",VLOOKUP(CONCATENATE(B330,\"-\",VLOOKUP(C330,afcterms_table,D330,FALSE)),'AfC Spine Data'!$R$4:$S$94,2,FALSE))","v":33037.199999999997},"CH-Salaries-AfC5-Q7","AfC 5 - Non Trainee Biomedical Scientist",{"$f":"IF(I101=\"XXX\",\"XXX\",IF($F330=\"NA\",\"XXX\",SUM(I101*$F330)))","v":"XXX"}]
[null,"5",11,21,"Salaries-AfC5-Q8",{"$f":"IF(ISERROR(VLOOKUP(CONCATENATE(B331,\"-\",VLOOKUP(C331,afcterms_table,D331,FALSE)),'AfC Spine Data'!$R$4:$S$94,2,FALSE))=TRUE,\"NA\",VLOOKUP(CONCATENATE(B331,\"-\",VLOOKUP(C331,afcterms_table,D331,FALSE)),'AfC Spine Data'!$R$4:$S$94,2,FALSE))","v":33037.199999999997},"CH-Salaries-AfC5-Q8","AfC 5 - Trainee Biomedical Scientist - Internally Funded",{"$f":"IF(I102=\"XXX\",\"XXX\",IF($F331=\"NA\",\"XXX\",SUM(I102*$F331*'AfC Spine Data'!$V$6)))","v":"XXX"}]
[null,"5",12,21,"Salaries-AfC5-Q9",{"$f":"IF(ISERROR(VLOOKUP(CONCATENATE(B332,\"-\",VLOOKUP(C332,afcterms_table,D332,FALSE)),'AfC Spine Data'!$R$4:$S$94,2,FALSE))=TRUE,\"NA\",VLOOKUP(CONCATENATE(B332,\"-\",VLOOKUP(C332,afcterms_table,D332,FALSE)),'AfC Spine Data'!$R$4:$S$94,2,FALSE))","v":33037.199999999997},"CH-Salaries-AfC5-Q9","AfC 5 - Trainee Biomedical Scientist - Externally Funded","XXX"]
[null,"5",13,21,"Salaries-AfC5-Q11",{"$f":"IF(ISERROR(VLOOKUP(CONCATENATE(B333,\"-\",VLOOKUP(C333,afcterms_table,D333,FALSE)),'AfC Spine Data'!$R$4:$S$94,2,FALSE))=TRUE,\"NA\",VLOOKUP(CONCATENATE(B333,\"-\",VLOOKUP(C333,afcterms_table,D333,FALSE)),'AfC Spine Data'!$R$4:$S$94,2,FALSE))","v":33037.199999999997},"CH-Salaries-AfC5-Q11","AfC 5 - Laboratory Support Worker/Medical Laboratory Assistant (MLA)",{"$f":"IF(I104=\"XXX\",\"XXX\",IF($F333=\"NA\",\"XXX\",SUM(I104*$F333)))","v":"XXX"}]
[null,"5",14,21,"Salaries-AfC5-Q12",{"$f":"IF(ISERROR(VLOOKUP(CONCATENATE(B334,\"-\",VLOOKUP(C334,afcterms_table,D334,FALSE)),'AfC Spine Data'!$R$4:$S$94,2,FALSE))=TRUE,\"NA\",VLOOKUP(CONCATENATE(B334,\"-\",VLOOKUP(C334,afcterms_table,D334,FALSE)),'AfC Spine Data'!$R$4:$S$94,2,FALSE))","v":33037.199999999997},"CH-Salaries-AfC5-Q12","AfC 5 - Associate Practitioner",{"$f":"IF(I105=\"XXX\",\"XXX\",IF($F334=\"NA\",\"XXX\",SUM(I105*$F334)))","v":"XXX"}]
[null,"5",15,21,"Salaries-AfC5-Q28",{"$f":"IF(ISERROR(VLOOKUP(CONCATENATE(B335,\"-\",VLOOKUP(C335,afcterms_table,D335,FALSE)),'AfC Spine Data'!$R$4:$S$94,2,FALSE))=TRUE,\"NA\",VLOOKUP(CONCATENATE(B335,\"-\",VLOOKUP(C335,afcterms_table,D335,FALSE)),'AfC Spine Data'!$R$4:$S$94,2,FALSE))","v":33037.199999999997},"CH-Salaries-AfC5-Q28","AfC 5 - Cytoscreeners",{"$f":"IF(I106=\"XXX\",\"XXX\",IF($F335=\"NA\",\"XXX\",SUM(I106*$F335)))","v":"XXX"}]
[null,"5",16,21,"Salaries-AfC5-Q14",{"$f":"IF(ISERROR(VLOOKUP(CONCATENATE(B336,\"-\",VLOOKUP(C336,afcterms_table,D336,FALSE)),'AfC Spine Data'!$R$4:$S$94,2,FALSE))=TRUE,\"NA\",VLOOKUP(CONCATENATE(B336,\"-\",VLOOKUP(C336,afcterms_table,D336,FALSE)),'AfC Spine Data'!$R$4:$S$94,2,FALSE))","v":33037.199999999997},"CH-Salaries-AfC5-Q14","AfC 5 - Administrative and Clerical Staff",{"$f":"IF(I107=\"XXX\",\"XXX\",IF($F336=\"NA\",\"XXX\",SUM(I107*$F336)))","v":"XXX"}]
[null,"5",17,21,"Salaries-AfC5-Q15",{"$f":"IF(ISERROR(VLOOKUP(CONCATENATE(B337,\"-\",VLOOKUP(C337,afcterms_table,D337,FALSE)),'AfC Spine Data'!$R$4:$S$94,2,FALSE))=TRUE,\"NA\",VLOOKUP(CONCATENATE(B337,\"-\",VLOOKUP(C337,afcterms_table,D337,FALSE)),'AfC Spine Data'!$R$4:$S$94,2,FALSE))","v":33037.199999999997},"CH-Salaries-AfC5-Q15","AfC 5 - Management Staff (Include Clinical Director, Finance Director, Lab Manager etc)",{"$f":"IF(I108=\"XXX\",\"XXX\",IF($F337=\"NA\",\"XXX\",SUM(I108*$F337)))","v":"XXX"}]
[null,"5",18,21,"Salaries-AfC5-Q16",{"$f":"IF(ISERROR(VLOOKUP(CONCATENATE(B338,\"-\",VLOOKUP(C338,afcterms_table,D338,FALSE)),'AfC Spine Data'!$R$4:$S$94,2,FALSE))=TRUE,\"NA\",VLOOKUP(CONCATENATE(B338,\"-\",VLOOKUP(C338,afcterms_table,D338,FALSE)),'AfC Spine Data'!$R$4:$S$94,2,FALSE))","v":33037.199999999997},"CH-Salaries-AfC5-Q16","AfC 5 - Quality Managers",{"$f":"IF(I109=\"XXX\",\"XXX\",IF($F338=\"NA\",\"XXX\",SUM(I109*$F338)))","v":"XXX"}]
[null,"5",19,21,"Salaries-AfC5-Q17",{"$f":"IF(ISERROR(VLOOKUP(CONCATENATE(B339,\"-\",VLOOKUP(C339,afcterms_table,D339,FALSE)),'AfC Spine Data'!$R$4:$S$94,2,FALSE))=TRUE,\"NA\",VLOOKUP(CONCATENATE(B339,\"-\",VLOOKUP(C339,afcterms_table,D339,FALSE)),'AfC Spine Data'!$R$4:$S$94,2,FALSE))","v":33037.199999999997},"CH-Salaries-AfC5-Q17","AfC 5 - IT Staff",{"$f":"IF(I110=\"XXX\",\"XXX\",IF($F339=\"NA\",\"XXX\",SUM(I110*$F339)))","v":"XXX"}]
[null,"5",20,21,"Salaries-AfC5-Q18",{"$f":"IF(ISERROR(VLOOKUP(CONCATENATE(B340,\"-\",VLOOKUP(C340,afcterms_table,D340,FALSE)),'AfC Spine Data'!$R$4:$S$94,2,FALSE))=TRUE,\"NA\",VLOOKUP(CONCATENATE(B340,\"-\",VLOOKUP(C340,afcterms_table,D340,FALSE)),'AfC Spine Data'!$R$4:$S$94,2,FALSE))","v":33037.199999999997},"CH-Salaries-AfC5-Q18","AfC 5 - Remaning Other Staff",{"$f":"IF(I111=\"XXX\",\"XXX\",IF($F340=\"NA\",\"XXX\",SUM(I111*$F340)))","v":"XXX"}]
[null,"5",21,21,"Salaries-AfC5-Q20",{"$f":"IF(ISERROR(VLOOKUP(CONCATENATE(B341,\"-\",VLOOKUP(C341,afcterms_table,D341,FALSE)),'AfC Spine Data'!$R$4:$S$94,2,FALSE))=TRUE,\"NA\",VLOOKUP(CONCATENATE(B341,\"-\",VLOOKUP(C341,afcterms_table,D341,FALSE)),'AfC Spine Data'!$R$4:$S$94,2,FALSE))","v":"NA"},"CH-Salaries-AfC5-Q20","AfC 5 - Total",{"$f":"IF(SUM(I325,I326,I327,I328,I330,I331,I332,I333,I334,I335,I336,I337,I338,I339,I340)=0,\"XXX\",SUM(I325,I326,I327,I328,I330,I331,I332,I333,I334,I335,I336,I337,I338,I339,I340))","v":"XXX"}]
[null,"6",6,22,"Salaries-AfC6-Q1",{"$f":"IF(ISERROR(VLOOKUP(CONCATENATE(B342,\"-\",VLOOKUP(C342,afcterms_table,D342,FALSE)),'AfC Spine Data'!$R$4:$S$94,2,FALSE))=TRUE,\"NA\",VLOOKUP(CONCATENATE(B342,\"-\",VLOOKUP(C342,afcterms_table,D342,FALSE)),'AfC Spine Data'!$R$4:$S$94,2,FALSE))","v":40981.5},"CH-Salaries-AfC6-Q1","AfC 6 - Consultant Clinical Scientist",{"$f":"IF(I113=\"XXX\",\"XXX\",IF($F342=\"NA\",\"XXX\",SUM(I113*$F342)))","v":"XXX"}]
[null,"6",7,22,"Salaries-AfC6-Q2",{"$f":"IF(ISERROR(VLOOKUP(CONCATENATE(B343,\"-\",VLOOKUP(C343,afcterms_table,D343,FALSE)),'AfC Spine Data'!$R$4:$S$94,2,FALSE))=TRUE,\"NA\",VLOOKUP(CONCATENATE(B343,\"-\",VLOOKUP(C343,afcterms_table,D343,FALSE)),'AfC Spine Data'!$R$4:$S$94,2,FALSE))","v":40981.5},"CH-Salaries-AfC6-Q2","AfC 6 - Non-Trainee, Non-Consultant Clinical Scientist",{"$f":"IF(I114=\"XXX\",\"XXX\",IF($F343=\"NA\",\"XXX\",SUM(I114*$F343)))","v":"XXX"}]
[null,"6",8,22,"Salaries-AfC6-Q3",{"$f":"IF(ISERROR(VLOOKUP(CONCATENATE(B344,\"-\",VLOOKUP(C344,afcterms_table,D344,FALSE)),'AfC Spine Data'!$R$4:$S$94,2,FALSE))=TRUE,\"NA\",VLOOKUP(CONCATENATE(B344,\"-\",VLOOKUP(C344,afcterms_table,D344,FALSE)),'AfC Spine Data'!$R$4:$S$94,2,FALSE))","v":40981.5},"CH-Salaries-AfC6-Q3","AfC 6 - Trainee Clinical Scientist (eg STP) - Internally Funded",{"$f":"IF(I115=\"XXX\",\"XXX\",IF($F344=\"NA\",\"XXX\",SUM(I115*$F344*'AfC Spine Data'!$V$5)))","v":"XXX"}]
[null,"6",9,22,"Salaries-AfC6-Q4",{"$f":"IF(ISERROR(VLOOKUP(CONCATENATE(B345,\"-\",VLOOKUP(C345,afcterms_table,D345,FALSE)),'AfC Spine Data'!$R$4:$S$94,2,FALSE))=TRUE,\"NA\",VLOOKUP(CONCATENATE(B345,\"-\",VLOOKUP(C345,afcterms_table,D345,FALSE)),'AfC Spine Data'!$R$4:$S$94,2,FALSE))","v":40981.5},"CH-Salaries-AfC6-Q4","AfC 6 - Trainee Clinical Scientist (eg STP) - Externally Funded","XXX"]
[null,"6",null,22,"Salaries-AfC6-Q6",{"$f":"IF(ISERROR(VLOOKUP(CONCATENATE(B346,\"-\",VLOOKUP(C346,afcterms_table,D346,FALSE)),'AfC Spine Data'!$R$4:$S$94,2,FALSE))=TRUE,\"NA\",VLOOKUP(CONCATENATE(B346,\"-\",VLOOKUP(C346,afcterms_table,D346,FALSE)),'AfC Spine Data'!$R$4:$S$94,2,FALSE))","v":"NA"},"CH-Salaries-AfC6-Q6","AfC 6 - Consultant Biomedical Scientist",{"$f":"IF(I117=\"XXX\",\"XXX\",IF($F346=\"NA\",\"XXX\",SUM(I117*$F346)))","v":"XXX"}]
[null,"6",10,22,"Salaries-AfC6-Q7",{"$f":"IF(ISERROR(VLOOKUP(CONCATENATE(B347,\"-\",VLOOKUP(C347,afcterms_table,D347,FALSE)),'AfC Spine Data'!$R$4:$S$94,2,FALSE))=TRUE,\"NA\",VLOOKUP(CONCATENATE(B347,\"-\",VLOOKUP(C347,afcterms_table,D347,FALSE)),'AfC Spine Data'!$R$4:$S$94,2,FALSE))","v":40981.5},"CH-Salaries-AfC6-Q7","AfC 6 - Non Trainee Biomedical Scientist",{"$f":"IF(I118=\"XXX\",\"XXX\",IF($F347=\"NA\",\"XXX\",SUM(I118*$F347)))","v":"XXX"}]
[null,"6",11,22,"Salaries-AfC6-Q8",{"$f":"IF(ISERROR(VLOOKUP(CONCATENATE(B348,\"-\",VLOOKUP(C348,afcterms_table,D348,FALSE)),'AfC Spine Data'!$R$4:$S$94,2,FALSE))=TRUE,\"NA\",VLOOKUP(CONCATENATE(B348,\"-\",VLOOKUP(C348,afcterms_table,D348,FALSE)),'AfC Spine Data'!$R$4:$S$94,2,FALSE))","v":40981.5},"CH-Salaries-AfC6-Q8","AfC 6 - Trainee Biomedical Scientist - Internally Funded",{"$f":"IF(I119=\"XXX\",\"XXX\",IF($F348=\"NA\",\"XXX\",SUM(I119*$F348*'AfC Spine Data'!$V$6)))","v":"XXX"}]
[null,"6",12,22,"Salaries-AfC6-Q9",{"$f":"IF(ISERROR(VLOOKUP(CONCATENATE(B349,\"-\",VLOOKUP(C349,afcterms_table,D349,FALSE)),'AfC Spine Data'!$R$4:$S$94,2,FALSE))=TRUE,\"NA\",VLOOKUP(CONCATENATE(B349,\"-\",VLOOKUP(C349,afcterms_table,D349,FALSE)),'AfC Spine Data'!$R$4:$S$94,2,FALSE))","v":40981.5},"CH-Salaries-AfC6-Q9","AfC 6 - Trainee Biomedical Scientist - Externally Funded","XXX"]
[null,"6",13,22,"Salaries-AfC6-Q11",{"$f":"IF(ISERROR(VLOOKUP(CONCATENATE(B350,\"-\",VLOOKUP(C350,afcterms_table,D350,FALSE)),'AfC Spine Data'!$R$4:$S$94,2,FALSE))=TRUE,\"NA\",VLOOKUP(CONCATENATE(B350,\"-\",VLOOKUP(C350,afcterms_table,D350,FALSE)),'AfC Spine Data'!$R$4:$S$94,2,FALSE))","v":40981.5},"CH-Salaries-AfC6-Q11","AfC 6 - Laboratory Support Worker/Medical Laboratory Assistant (MLA)",{"$f":"IF(I121=\"XXX\",\"XXX\",IF($F350=\"NA\",\"XXX\",SUM(I121*$F350)))","v":"XXX"}]
[null,"6",14,22,"Salaries-AfC6-Q12",{"$f":"IF(ISERROR(VLOOKUP(CONCATENATE(B351,\"-\",VLOOKUP(C351,afcterms_table,D351,FALSE)),'AfC Spine Data'!$R$4:$S$94,2,FALSE))=TRUE,\"NA\",VLOOKUP(CONCATENATE(B351,\"-\",VLOOKUP(C351,afcterms_table,D351,FALSE)),'AfC Spine Data'!$R$4:$S$94,2,FALSE))","v":40981.5},"CH-Salaries-AfC6-Q12","AfC 6 - Associate Practitioner",{"$f":"IF(I122=\"XXX\",\"XXX\",IF($F351=\"NA\",\"XXX\",SUM(I122*$F351)))","v":"XXX"}]
[null,"6",15,22,"Salaries-AfC6-Q28",{"$f":"IF(ISERROR(VLOOKUP(CONCATENATE(B352,\"-\",VLOOKUP(C352,afcterms_table,D352,FALSE)),'AfC Spine Data'!$R$4:$S$94,2,FALSE))=TRUE,\"NA\",VLOOKUP(CONCATENATE(B352,\"-\",VLOOKUP(C352,afcterms_table,D352,FALSE)),'AfC Spine Data'!$R$4:$S$94,2,FALSE))","v":40981.5},"CH-Salaries-AfC6-Q28","AfC 6 - Cytoscreeners",{"$f":"IF(I123=\"XXX\",\"XXX\",IF($F352=\"NA\",\"XXX\",SUM(I123*$F352)))","v":"XXX"}]
[null,"6",16,22,"Salaries-AfC6-Q14",{"$f":"IF(ISERROR(VLOOKUP(CONCATENATE(B353,\"-\",VLOOKUP(C353,afcterms_table,D353,FALSE)),'AfC Spine Data'!$R$4:$S$94,2,FALSE))=TRUE,\"NA\",VLOOKUP(CONCATENATE(B353,\"-\",VLOOKUP(C353,afcterms_table,D353,FALSE)),'AfC Spine Data'!$R$4:$S$94,2,FALSE))","v":40981.5},"CH-Salaries-AfC6-Q14","AfC 6 - Administrative and Clerical Staff",{"$f":"IF(I124=\"XXX\",\"XXX\",IF($F353=\"NA\",\"XXX\",SUM(I124*$F353)))","v":"XXX"}]
[null,"6",17,22,"Salaries-AfC6-Q15",{"$f":"IF(ISERROR(VLOOKUP(CONCATENATE(B354,\"-\",VLOOKUP(C354,afcterms_table,D354,FALSE)),'AfC Spine Data'!$R$4:$S$94,2,FALSE))=TRUE,\"NA\",VLOOKUP(CONCATENATE(B354,\"-\",VLOOKUP(C354,afcterms_table,D354,FALSE)),'AfC Spine Data'!$R$4:$S$94,2,FALSE))","v":40981.5},"CH-Salaries-AfC6-Q15","AfC 6 - Management Staff (Include Clinical Director, Finance Director, Lab Manager etc)",{"$f":"IF(I125=\"XXX\",\"XXX\",IF($F354=\"NA\",\"XXX\",SUM(I125*$F354)))","v":"XXX"}]
[null,"6",18,22,"Salaries-AfC6-Q16",{"$f":"IF(ISERROR(VLOOKUP(CONCATENATE(B355,\"-\",VLOOKUP(C355,afcterms_table,D355,FALSE)),'AfC Spine Data'!$R$4:$S$94,2,FALSE))=TRUE,\"NA\",VLOOKUP(CONCATENATE(B355,\"-\",VLOOKUP(C355,afcterms_table,D355,FALSE)),'AfC Spine Data'!$R$4:$S$94,2,FALSE))","v":40981.5},"CH-Salaries-AfC6-Q16","AfC 6 - Quality Managers",{"$f":"IF(I126=\"XXX\",\"XXX\",IF($F355=\"NA\",\"XXX\",SUM(I126*$F355)))","v":"XXX"}]
[null,"6",19,22,"Salaries-AfC6-Q17",{"$f":"IF(ISERROR(VLOOKUP(CONCATENATE(B356,\"-\",VLOOKUP(C356,afcterms_table,D356,FALSE)),'AfC Spine Data'!$R$4:$S$94,2,FALSE))=TRUE,\"NA\",VLOOKUP(CONCATENATE(B356,\"-\",VLOOKUP(C356,afcterms_table,D356,FALSE)),'AfC Spine Data'!$R$4:$S$94,2,FALSE))","v":40981.5},"CH-Salaries-AfC6-Q17","AfC 6 - IT Staff",{"$f":"IF(I127=\"XXX\",\"XXX\",IF($F356=\"NA\",\"XXX\",SUM(I127*$F356)))","v":"XXX"}]
[null,"6",20,22,"Salaries-AfC6-Q18",{"$f":"IF(ISERROR(VLOOKUP(CONCATENATE(B357,\"-\",VLOOKUP(C357,afcterms_table,D357,FALSE)),'AfC Spine Data'!$R$4:$S$94,2,FALSE))=TRUE,\"NA\",VLOOKUP(CONCATENATE(B357,\"-\",VLOOKUP(C357,afcterms_table,D357,FALSE)),'AfC Spine Data'!$R$4:$S$94,2,FALSE))","v":40981.5},"CH-Salaries-AfC6-Q18","AfC 6 - Remaning Other Staff",{"$f":"IF(I128=\"XXX\",\"XXX\",IF($F357=\"NA\",\"XXX\",SUM(I128*$F357)))","v":"XXX"}]
[null,"6",21,22,"Salaries-AfC6-Q20",{"$f":"IF(ISERROR(VLOOKUP(CONCATENATE(B358,\"-\",VLOOKUP(C358,afcterms_table,D358,FALSE)),'AfC Spine Data'!$R$4:$S$94,2,FALSE))=TRUE,\"NA\",VLOOKUP(CONCATENATE(B358,\"-\",VLOOKUP(C358,afcterms_table,D358,FALSE)),'AfC Spine Data'!$R$4:$S$94,2,FALSE))","v":"NA"},"CH-Salaries-AfC6-Q20","AfC 6 - Total",{"$f":"IF(SUM(I342,I343,I344,I345,I347,I348,I349,I350,I351,I352,I353,I354,I355,I356,I357)=0,\"XXX\",SUM(I342,I343,I344,I345,I347,I348,I349,I350,I351,I352,I353,I354,I355,I356,I357))","v":"XXX"}]
[null,"7",6,22,"Salaries-AfC7-Q1",{"$f":"IF(ISERROR(VLOOKUP(CONCATENATE(B359,\"-\",VLOOKUP(C359,afcterms_table,D359,FALSE)),'AfC Spine Data'!$R$4:$S$94,2,FALSE))=TRUE,\"NA\",VLOOKUP(CONCATENATE(B359,\"-\",VLOOKUP(C359,afcterms_table,D359,FALSE)),'AfC Spine Data'!$R$4:$S$94,2,FALSE))","v":48843.9},"CH-Salaries-AfC7-Q1","AfC 7 - Consultant Clinical Scientist",{"$f":"IF(I130=\"XXX\",\"XXX\",IF($F359=\"NA\",\"XXX\",SUM(I130*$F359)))","v":"XXX"}]
[null,"7",7,22,"Salaries-AfC7-Q2",{"$f":"IF(ISERROR(VLOOKUP(CONCATENATE(B360,\"-\",VLOOKUP(C360,afcterms_table,D360,FALSE)),'AfC Spine Data'!$R$4:$S$94,2,FALSE))=TRUE,\"NA\",VLOOKUP(CONCATENATE(B360,\"-\",VLOOKUP(C360,afcterms_table,D360,FALSE)),'AfC Spine Data'!$R$4:$S$94,2,FALSE))","v":48843.9},"CH-Salaries-AfC7-Q2","AfC 7 - Non-Trainee, Non-Consultant Clinical Scientist",{"$f":"IF(I131=\"XXX\",\"XXX\",IF($F360=\"NA\",\"XXX\",SUM(I131*$F360)))","v":"XXX"}]
[null,"7",8,22,"Salaries-AfC7-Q3",{"$f":"IF(ISERROR(VLOOKUP(CONCATENATE(B361,\"-\",VLOOKUP(C361,afcterms_table,D361,FALSE)),'AfC Spine Data'!$R$4:$S$94,2,FALSE))=TRUE,\"NA\",VLOOKUP(CONCATENATE(B361,\"-\",VLOOKUP(C361,afcterms_table,D361,FALSE)),'AfC Spine Data'!$R$4:$S$94,2,FALSE))","v":48843.9},"CH-Salaries-AfC7-Q3","AfC 7 - Trainee Clinical Scientist (eg STP) - Internally Funded",{"$f":"IF(I132=\"XXX\",\"XXX\",IF($F361=\"NA\",\"XXX\",SUM(I132*$F361*'AfC Spine Data'!$V$5)))","v":"XXX"}]
[null,"7",9,22,"Salaries-AfC7-Q4",{"$f":"IF(ISERROR(VLOOKUP(CONCATENATE(B362,\"-\",VLOOKUP(C362,afcterms_table,D362,FALSE)),'AfC Spine Data'!$R$4:$S$94,2,FALSE))=TRUE,\"NA\",VLOOKUP(CONCATENATE(B362,\"-\",VLOOKUP(C362,afcterms_table,D362,FALSE)),'AfC Spine Data'!$R$4:$S$94,2,FALSE))","v":48843.9},"CH-Salaries-AfC7-Q4","AfC 7 - Trainee Clinical Scientist (eg STP) - Externally Funded","XXX"]
[null,"7",null,22,"Salaries-AfC7-Q6",{"$f":"IF(ISERROR(VLOOKUP(CONCATENATE(B363,\"-\",VLOOKUP(C363,afcterms_table,D363,FALSE)),'AfC Spine Data'!$R$4:$S$94,2,FALSE))=TRUE,\"NA\",VLOOKUP(CONCATENATE(B363,\"-\",VLOOKUP(C363,afcterms_table,D363,FALSE)),'AfC Spine Data'!$R$4:$S$94,2,FALSE))","v":"NA"},{"$f":"CONCATENATE($F$2,\"-\",E363)","v":"CH-Salaries-AfC7-Q6"},"AfC 7 - Consultant Biomedical Scientist",{"$f":"IF(I134=\"XXX\",\"XXX\",IF($F363=\"NA\",\"XXX\",SUM(I134*$F363)))","v":"XXX"}]
[null,"7",10,22,"Salaries-AfC7-Q7",{"$f":"IF(ISERROR(VLOOKUP(CONCATENATE(B364,\"-\",VLOOKUP(C364,afcterms_table,D364,FALSE)),'AfC Spine Data'!$R$4:$S$94,2,FALSE))=TRUE,\"NA\",VLOOKUP(CONCATENATE(B364,\"-\",VLOOKUP(C364,afcterms_table,D364,FALSE)),'AfC Spine Data'!$R$4:$S$94,2,FALSE))","v":48843.9},"CH-Salaries-AfC7-Q7","AfC 7 - Non Trainee Biomedical Scientist",{"$f":"IF(I135=\"XXX\",\"XXX\",IF($F364=\"NA\",\"XXX\",SUM(I135*$F364)))","v":"XXX"}]
[null,"7",11,22,"Salaries-AfC7-Q8",{"$f":"IF(ISERROR(VLOOKUP(CONCATENATE(B365,\"-\",VLOOKUP(C365,afcterms_table,D365,FALSE)),'AfC Spine Data'!$R$4:$S$94,2,FALSE))=TRUE,\"NA\",VLOOKUP(CONCATENATE(B365,\"-\",VLOOKUP(C365,afcterms_table,D365,FALSE)),'AfC Spine Data'!$R$4:$S$94,2,FALSE))","v":48843.9},"CH-Salaries-AfC7-Q8","AfC 7 - Trainee Biomedical Scientist - Internally Funded",{"$f":"IF(I136=\"XXX\",\"XXX\",IF($F365=\"NA\",\"XXX\",SUM(I136*$F365*'AfC Spine Data'!$V$6)))","v":"XXX"}]
[null,"7",12,22,"Salaries-AfC7-Q9",{"$f":"IF(ISERROR(VLOOKUP(CONCATENATE(B366,\"-\",VLOOKUP(C366,afcterms_table,D366,FALSE)),'AfC Spine Data'!$R$4:$S$94,2,FALSE))=TRUE,\"NA\",VLOOKUP(CONCATENATE(B366,\"-\",VLOOKUP(C366,afcterms_table,D366,FALSE)),'AfC Spine Data'!$R$4:$S$94,2,FALSE))","v":48843.9},"CH-Salaries-AfC7-Q9","AfC 7 - Trainee Biomedical Scientist - Externally Funded","XXX"]
[null,"7",13,22,"Salaries-AfC7-Q11",{"$f":"IF(ISERROR(VLOOKUP(CONCATENATE(B367,\"-\",VLOOKUP(C367,afcterms_table,D367,FALSE)),'AfC Spine Data'!$R$4:$S$94,2,FALSE))=TRUE,\"NA\",VLOOKUP(CONCATENATE(B367,\"-\",VLOOKUP(C367,afcterms_table,D367,FALSE)),'AfC Spine Data'!$R$4:$S$94,2,FALSE))","v":48843.9},"CH-Salaries-AfC7-Q11","AfC 7 - Laboratory Support Worker/Medical Laboratory Assistant (MLA)",{"$f":"IF(I138=\"XXX\",\"XXX\",IF($F367=\"NA\",\"XXX\",SUM(I138*$F367)))","v":"XXX"}]
[null,"7",14,22,"Salaries-AfC7-Q12",{"$f":"IF(ISERROR(VLOOKUP(CONCATENATE(B368,\"-\",VLOOKUP(C368,afcterms_table,D368,FALSE)),'AfC Spine Data'!$R$4:$S$94,2,FALSE))=TRUE,\"NA\",VLOOKUP(CONCATENATE(B368,\"-\",VLOOKUP(C368,afcterms_table,D368,FALSE)),'AfC Spine Data'!$R$4:$S$94,2,FALSE))","v":48843.9},"CH-Salaries-AfC7-Q12","AfC 7 - Associate Practitioner",{"$f":"IF(I139=\"XXX\",\"XXX\",IF($F368=\"NA\",\"XXX\",SUM(I139*$F368)))","v":"XXX"}]
[null,"7",15,22,"Salaries-AfC7-Q28",{"$f":"IF(ISERROR(VLOOKUP(CONCATENATE(B369,\"-\",VLOOKUP(C369,afcterms_table,D369,FALSE)),'AfC Spine Data'!$R$4:$S$94,2,FALSE))=TRUE,\"NA\",VLOOKUP(CONCATENATE(B369,\"-\",VLOOKUP(C369,afcterms_table,D369,FALSE)),'AfC Spine Data'!$R$4:$S$94,2,FALSE))","v":48843.9},"CH-Salaries-AfC7-Q28","AfC 7 - Cytoscreeners",{"$f":"IF(I140=\"XXX\",\"XXX\",IF($F369=\"NA\",\"XXX\",SUM(I140*$F369)))","v":"XXX"}]
[null,"7",16,22,"Salaries-AfC7-Q14",{"$f":"IF(ISERROR(VLOOKUP(CONCATENATE(B370,\"-\",VLOOKUP(C370,afcterms_table,D370,FALSE)),'AfC Spine Data'!$R$4:$S$94,2,FALSE))=TRUE,\"NA\",VLOOKUP(CONCATENATE(B370,\"-\",VLOOKUP(C370,afcterms_table,D370,FALSE)),'AfC Spine Data'!$R$4:$S$94,2,FALSE))","v":48843.9},"CH-Salaries-AfC7-Q14","AfC 7 - Administrative and Clerical Staff",{"$f":"IF(I141=\"XXX\",\"XXX\",IF($F370=\"NA\",\"XXX\",SUM(I141*$F370)))","v":"XXX"}]
[null,"7",17,22,"Salaries-AfC7-Q15",{"$f":"IF(ISERROR(VLOOKUP(CONCATENATE(B371,\"-\",VLOOKUP(C371,afcterms_table,D371,FALSE)),'AfC Spine Data'!$R$4:$S$94,2,FALSE))=TRUE,\"NA\",VLOOKUP(CONCATENATE(B371,\"-\",VLOOKUP(C371,afcterms_table,D371,FALSE)),'AfC Spine Data'!$R$4:$S$94,2,FALSE))","v":48843.9},"CH-Salaries-AfC7-Q15","AfC 7 - Management Staff (Include Clinical Director, Finance Director, Lab Manager etc)",{"$f":"IF(I142=\"XXX\",\"XXX\",IF($F371=\"NA\",\"XXX\",SUM(I142*$F371)))","v":"XXX"}]
[null,"7",18,22,"Salaries-AfC7-Q16",{"$f":"IF(ISERROR(VLOOKUP(CONCATENATE(B372,\"-\",VLOOKUP(C372,afcterms_table,D372,FALSE)),'AfC Spine Data'!$R$4:$S$94,2,FALSE))=TRUE,\"NA\",VLOOKUP(CONCATENATE(B372,\"-\",VLOOKUP(C372,afcterms_table,D372,FALSE)),'AfC Spine Data'!$R$4:$S$94,2,FALSE))","v":48843.9},"CH-Salaries-AfC7-Q16","AfC 7 - Quality Managers",{"$f":"IF(I143=\"XXX\",\"XXX\",IF($F372=\"NA\",\"XXX\",SUM(I143*$F372)))","v":"XXX"}]
[null,"7",19,22,"Salaries-AfC7-Q17",{"$f":"IF(ISERROR(VLOOKUP(CONCATENATE(B373,\"-\",VLOOKUP(C373,afcterms_table,D373,FALSE)),'AfC Spine Data'!$R$4:$S$94,2,FALSE))=TRUE,\"NA\",VLOOKUP(CONCATENATE(B373,\"-\",VLOOKUP(C373,afcterms_table,D373,FALSE)),'AfC Spine Data'!$R$4:$S$94,2,FALSE))","v":48843.9},"CH-Salaries-AfC7-Q17","AfC 7 - IT Staff",{"$f":"IF(I144=\"XXX\",\"XXX\",IF($F373=\"NA\",\"XXX\",SUM(I144*$F373)))","v":"XXX"}]
[null,"7",20,22,"Salaries-AfC7-Q18",{"$f":"IF(ISERROR(VLOOKUP(CONCATENATE(B374,\"-\",VLOOKUP(C374,afcterms_table,D374,FALSE)),'AfC Spine Data'!$R$4:$S$94,2,FALSE))=TRUE,\"NA\",VLOOKUP(CONCATENATE(B374,\"-\",VLOOKUP(C374,afcterms_table,D374,FALSE)),'AfC Spine Data'!$R$4:$S$94,2,FALSE))","v":48843.9},"CH-Salaries-AfC7-Q18","AfC 7 - Remaning Other Staff",{"$f":"IF(I145=\"XXX\",\"XXX\",IF($F374=\"NA\",\"XXX\",SUM(I145*$F374)))","v":"XXX"}]
[null,"7",21,22,"Salaries-AfC7-Q20",{"$f":"IF(ISERROR(VLOOKUP(CONCATENATE(B375,\"-\",VLOOKUP(C375,afcterms_table,D375,FALSE)),'AfC Spine Data'!$R$4:$S$94,2,FALSE))=TRUE,\"NA\",VLOOKUP(CONCATENATE(B375,\"-\",VLOOKUP(C375,afcterms_table,D375,FALSE)),'AfC Spine Data'!$R$4:$S$94,2,FALSE))","v":"NA"},"CH-Salaries-AfC7-Q20","AfC 7 - Total",{"$f":"IF(SUM(I359,I360,I361,I362,I364,I365,I366,I367,I368,I369,I370,I371,I372,I373,I374)=0,\"XXX\",SUM(I359,I360,I361,I362,I364,I365,I366,I367,I368,I369,I370,I371,I372,I373,I374))","v":"XXX"}]
[null,"8a",6,23,"Salaries-AfC8a-Q1",{"$f":"IF(ISERROR(VLOOKUP(CONCATENATE(B376,\"-\",VLOOKUP(C376,afcterms_table,D376,FALSE)),'AfC Spine Data'!$R$4:$S$94,2,FALSE))=TRUE,\"NA\",VLOOKUP(CONCATENATE(B376,\"-\",VLOOKUP(C376,afcterms_table,D376,FALSE)),'AfC Spine Data'!$R$4:$S$94,2,FALSE))","v":57290.31},"CH-Salaries-AfC8a-Q1","AfC 8a - Consultant Clinical Scientist",{"$f":"IF(I147=\"XXX\",\"XXX\",IF($F376=\"NA\",\"XXX\",SUM(I147*$F376)))","v":"XXX"}]
[null,"8a",7,23,"Salaries-AfC8a-Q2",{"$f":"IF(ISERROR(VLOOKUP(CONCATENATE(B377,\"-\",VLOOKUP(C377,afcterms_table,D377,FALSE)),'AfC Spine Data'!$R$4:$S$94,2,FALSE))=TRUE,\"NA\",VLOOKUP(CONCATENATE(B377,\"-\",VLOOKUP(C377,afcterms_table,D377,FALSE)),'AfC Spine Data'!$R$4:$S$94,2,FALSE))","v":57290.31},"CH-Salaries-AfC8a-Q2","AfC 8a - Non-Trainee, Non-Consultant Clinical Scientist",{"$f":"IF(I148=\"XXX\",\"XXX\",IF($F377=\"NA\",\"XXX\",SUM(I148*$F377)))","v":"XXX"}]
[null,"8a",8,23,"Salaries-AfC8a-Q3",{"$f":"IF(ISERROR(VLOOKUP(CONCATENATE(B378,\"-\",VLOOKUP(C378,afcterms_table,D378,FALSE)),'AfC Spine Data'!$R$4:$S$94,2,FALSE))=TRUE,\"NA\",VLOOKUP(CONCATENATE(B378,\"-\",VLOOKUP(C378,afcterms_table,D378,FALSE)),'AfC Spine Data'!$R$4:$S$94,2,FALSE))","v":57290.31},"CH-Salaries-AfC8a-Q3","AfC 8a - Trainee Clinical Scientist (eg STP) - Internally Funded",{"$f":"IF(I149=\"XXX\",\"XXX\",IF($F378=\"NA\",\"XXX\",SUM(I149*$F378*'AfC Spine Data'!$V$5)))","v":"XXX"}]
[null,"8a",9,23,"Salaries-AfC8a-Q4",{"$f":"IF(ISERROR(VLOOKUP(CONCATENATE(B379,\"-\",VLOOKUP(C379,afcterms_table,D379,FALSE)),'AfC Spine Data'!$R$4:$S$94,2,FALSE))=TRUE,\"NA\",VLOOKUP(CONCATENATE(B379,\"-\",VLOOKUP(C379,afcterms_table,D379,FALSE)),'AfC Spine Data'!$R$4:$S$94,2,FALSE))","v":57290.31},"CH-Salaries-AfC8a-Q4","AfC 8a - Trainee Clinical Scientist (eg STP) - Externally Funded","XXX"]
[null,"8a",null,23,"Salaries-AfC8a-Q6",{"$f":"IF(ISERROR(VLOOKUP(CONCATENATE(B380,\"-\",VLOOKUP(C380,afcterms_table,D380,FALSE)),'AfC Spine Data'!$R$4:$S$94,2,FALSE))=TRUE,\"NA\",VLOOKUP(CONCATENATE(B380,\"-\",VLOOKUP(C380,afcterms_table,D380,FALSE)),'AfC Spine Data'!$R$4:$S$94,2,FALSE))","v":"NA"},"CH-Salaries-AfC8a-Q6","AfC 8a - Consultant Biomedical Scientist",{"$f":"IF(I151=\"XXX\",\"XXX\",IF($F380=\"NA\",\"XXX\",SUM(I151*$F380)))","v":"XXX"}]
[null,"8a",10,23,"Salaries-AfC8a-Q7",{"$f":"IF(ISERROR(VLOOKUP(CONCATENATE(B381,\"-\",VLOOKUP(C381,afcterms_table,D381,FALSE)),'AfC Spine Data'!$R$4:$S$94,2,FALSE))=TRUE,\"NA\",VLOOKUP(CONCATENATE(B381,\"-\",VLOOKUP(C381,afcterms_table,D381,FALSE)),'AfC Spine Data'!$R$4:$S$94,2,FALSE))","v":57290.31},"CH-Salaries-AfC8a-Q7","AfC 8a - Non Trainee Biomedical Scientist",{"$f":"IF(I152=\"XXX\",\"XXX\",IF($F381=\"NA\",\"XXX\",SUM(I152*$F381)))","v":"XXX"}]
[null,"8a",11,23,"Salaries-AfC8a-Q8",{"$f":"IF(ISERROR(VLOOKUP(CONCATENATE(B382,\"-\",VLOOKUP(C382,afcterms_table,D382,FALSE)),'AfC Spine Data'!$R$4:$S$94,2,FALSE))=TRUE,\"NA\",VLOOKUP(CONCATENATE(B382,\"-\",VLOOKUP(C382,afcterms_table,D382,FALSE)),'AfC Spine Data'!$R$4:$S$94,2,FALSE))","v":57290.31},"CH-Salaries-AfC8a-Q8","AfC 8a - Trainee Biomedical Scientist - Internally Funded",{"$f":"IF(I153=\"XXX\",\"XXX\",IF($F382=\"NA\",\"XXX\",SUM(I153*$F382*'AfC Spine Data'!$V$6)))","v":"XXX"}]
[null,"8a",12,23,"Salaries-AfC8a-Q9",{"$f":"IF(ISERROR(VLOOKUP(CONCATENATE(B383,\"-\",VLOOKUP(C383,afcterms_table,D383,FALSE)),'AfC Spine Data'!$R$4:$S$94,2,FALSE))=TRUE,\"NA\",VLOOKUP(CONCATENATE(B383,\"-\",VLOOKUP(C383,afcterms_table,D383,FALSE)),'AfC Spine Data'!$R$4:$S$94,2,FALSE))","v":57290.31},"CH-Salaries-AfC8a-Q9","AfC 8a - Trainee Biomedical Scientist - Externally Funded","XXX"]
[null,"8a",13,23,"Salaries-AfC8a-Q11",{"$f":"IF(ISERROR(VLOOKUP(CONCATENATE(B384,\"-\",VLOOKUP(C384,afcterms_table,D384,FALSE)),'AfC Spine Data'!$R$4:$S$94,2,FALSE))=TRUE,\"NA\",VLOOKUP(CONCATENATE(B384,\"-\",VLOOKUP(C384,afcterms_table,D384,FALSE)),'AfC Spine Data'!$R$4:$S$94,2,FALSE))","v":57290.31},"CH-Salaries-AfC8a-Q11","AfC 8a - Laboratory Support Worker/Medical Laboratory Assistant (MLA)",{"$f":"IF(I155=\"XXX\",\"XXX\",IF($F384=\"NA\",\"XXX\",SUM(I155*$F384)))","v":"XXX"}]
[null,"8a",14,23,"Salaries-AfC8a-Q12",{"$f":"IF(ISERROR(VLOOKUP(CONCATENATE(B385,\"-\",VLOOKUP(C385,afcterms_table,D385,FALSE)),'AfC Spine Data'!$R$4:$S$94,2,FALSE))=TRUE,\"NA\",VLOOKUP(CONCATENATE(B385,\"-\",VLOOKUP(C385,afcterms_table,D385,FALSE)),'AfC Spine Data'!$R$4:$S$94,2,FALSE))","v":57290.31},"CH-Salaries-AfC8a-Q12","AfC 8a - Associate Practitioner",{"$f":"IF(I156=\"XXX\",\"XXX\",IF($F385=\"NA\",\"XXX\",SUM(I156*$F385)))","v":"XXX"}]
[null,"8a",15,23,"Salaries-AfC8a-Q28",{"$f":"IF(ISERROR(VLOOKUP(CONCATENATE(B386,\"-\",VLOOKUP(C386,afcterms_table,D386,FALSE)),'AfC Spine Data'!$R$4:$S$94,2,FALSE))=TRUE,\"NA\",VLOOKUP(CONCATENATE(B386,\"-\",VLOOKUP(C386,afcterms_table,D386,FALSE)),'AfC Spine Data'!$R$4:$S$94,2,FALSE))","v":57290.31},"CH-Salaries-AfC8a-Q28","AfC 8a - Cytoscreeners",{"$f":"IF(I157=\"XXX\",\"XXX\",IF($F386=\"NA\",\"XXX\",SUM(I157*$F386)))","v":"XXX"}]
[null,"8a",16,23,"Salaries-AfC8a-Q14",{"$f":"IF(ISERROR(VLOOKUP(CONCATENATE(B387,\"-\",VLOOKUP(C387,afcterms_table,D387,FALSE)),'AfC Spine Data'!$R$4:$S$94,2,FALSE))=TRUE,\"NA\",VLOOKUP(CONCATENATE(B387,\"-\",VLOOKUP(C387,afcterms_table,D387,FALSE)),'AfC Spine Data'!$R$4:$S$94,2,FALSE))","v":57290.31},"CH-Salaries-AfC8a-Q14","AfC 8a - Administrative and Clerical Staff",{"$f":"IF(I158=\"XXX\",\"XXX\",IF($F387=\"NA\",\"XXX\",SUM(I158*$F387)))","v":"XXX"}]
[null,"8a",17,23,"Salaries-AfC8a-Q15",{"$f":"IF(ISERROR(VLOOKUP(CONCATENATE(B388,\"-\",VLOOKUP(C388,afcterms_table,D388,FALSE)),'AfC Spine Data'!$R$4:$S$94,2,FALSE))=TRUE,\"NA\",VLOOKUP(CONCATENATE(B388,\"-\",VLOOKUP(C388,afcterms_table,D388,FALSE)),'AfC Spine Data'!$R$4:$S$94,2,FALSE))","v":57290.31},"CH-Salaries-AfC8a-Q15","AfC 8a - Management Staff (Include Clinical Director, Finance Director, Lab Manager etc)",{"$f":"IF(I159=\"XXX\",\"XXX\",IF($F388=\"NA\",\"XXX\",SUM(I159*$F388)))","v":"XXX"}]
[null,"8a",18,23,"Salaries-AfC8a-Q16",{"$f":"IF(ISERROR(VLOOKUP(CONCATENATE(B389,\"-\",VLOOKUP(C389,afcterms_table,D389,FALSE)),'AfC Spine Data'!$R$4:$S$94,2,FALSE))=TRUE,\"NA\",VLOOKUP(CONCATENATE(B389,\"-\",VLOOKUP(C389,afcterms_table,D389,FALSE)),'AfC Spine Data'!$R$4:$S$94,2,FALSE))","v":57290.31},"CH-Salaries-AfC8a-Q16","AfC 8a - Quality Managers",{"$f":"IF(I160=\"XXX\",\"XXX\",IF($F389=\"NA\",\"XXX\",SUM(I160*$F389)))","v":"XXX"}]
[null,"8a",19,23,"Salaries-AfC8a-Q17",{"$f":"IF(ISERROR(VLOOKUP(CONCATENATE(B390,\"-\",VLOOKUP(C390,afcterms_table,D390,FALSE)),'AfC Spine Data'!$R$4:$S$94,2,FALSE))=TRUE,\"NA\",VLOOKUP(CONCATENATE(B390,\"-\",VLOOKUP(C390,afcterms_table,D390,FALSE)),'AfC Spine Data'!$R$4:$S$94,2,FALSE))","v":57290.31},"CH-Salaries-AfC8a-Q17","AfC 8a - IT Staff",{"$f":"IF(I161=\"XXX\",\"XXX\",IF($F390=\"NA\",\"XXX\",SUM(I161*$F390)))","v":"XXX"}]
[null,"8a",20,23,"Salaries-AfC8a-Q18",{"$f":"IF(ISERROR(VLOOKUP(CONCATENATE(B391,\"-\",VLOOKUP(C391,afcterms_table,D391,FALSE)),'AfC Spine Data'!$R$4:$S$94,2,FALSE))=TRUE,\"NA\",VLOOKUP(CONCATENATE(B391,\"-\",VLOOKUP(C391,afcterms_table,D391,FALSE)),'AfC Spine Data'!$R$4:$S$94,2,FALSE))","v":57290.31},"CH-Salaries-AfC8a-Q18","AfC 8a - Remaning Other Staff",{"$f":"IF(I162=\"XXX\",\"XXX\",IF($F391=\"NA\",\"XXX\",SUM(I162*$F391)))","v":"XXX"}]
[null,"8a",21,23,"Salaries-AfC8a-Q20",{"$f":"IF(ISERROR(VLOOKUP(CONCATENATE(B392,\"-\",VLOOKUP(C392,afcterms_table,D392,FALSE)),'AfC Spine Data'!$R$4:$S$94,2,FALSE))=TRUE,\"NA\",VLOOKUP(CONCATENATE(B392,\"-\",VLOOKUP(C392,afcterms_table,D392,FALSE)),'AfC Spine Data'!$R$4:$S$94,2,FALSE))","v":"NA"},"CH-Salaries-AfC8a-Q20","AfC 8a - Total",{"$f":"IF(SUM(I376,I377,I378,I379,I381,I382,I383,I384,I385,I386,I387,I388,I389,I390,I391)=0,\"XXX\",SUM(I376,I377,I378,I379,I381,I382,I383,I384,I385,I386,I387,I388,I389,I390,I391))","v":"XXX"}]
[null,"8b",6,23,"Salaries-AfC8b-Q1",{"$f":"IF(ISERROR(VLOOKUP(CONCATENATE(B393,\"-\",VLOOKUP(C393,afcterms_table,D393,FALSE)),'AfC Spine Data'!$R$4:$S$94,2,FALSE))=TRUE,\"NA\",VLOOKUP(CONCATENATE(B393,\"-\",VLOOKUP(C393,afcterms_table,D393,FALSE)),'AfC Spine Data'!$R$4:$S$94,2,FALSE))","v":67745.16},"CH-Salaries-AfC8b-Q1","AfC 8b - Consultant Clinical Scientist",{"$f":"IF(I164=\"XXX\",\"XXX\",IF($F393=\"NA\",\"XXX\",SUM(I164*$F393)))","v":"XXX"}]
[null,"8b",7,23,"Salaries-AfC8b-Q2",{"$f":"IF(ISERROR(VLOOKUP(CONCATENATE(B394,\"-\",VLOOKUP(C394,afcterms_table,D394,FALSE)),'AfC Spine Data'!$R$4:$S$94,2,FALSE))=TRUE,\"NA\",VLOOKUP(CONCATENATE(B394,\"-\",VLOOKUP(C394,afcterms_table,D394,FALSE)),'AfC Spine Data'!$R$4:$S$94,2,FALSE))","v":67745.16},"CH-Salaries-AfC8b-Q2","AfC 8b - Non-Trainee, Non-Consultant Clinical Scientist",{"$f":"IF(I165=\"XXX\",\"XXX\",IF($F394=\"NA\",\"XXX\",SUM(I165*$F394)))","v":"XXX"}]
[null,"8b",8,23,"Salaries-AfC8b-Q3",{"$f":"IF(ISERROR(VLOOKUP(CONCATENATE(B395,\"-\",VLOOKUP(C395,afcterms_table,D395,FALSE)),'AfC Spine Data'!$R$4:$S$94,2,FALSE))=TRUE,\"NA\",VLOOKUP(CONCATENATE(B395,\"-\",VLOOKUP(C395,afcterms_table,D395,FALSE)),'AfC Spine Data'!$R$4:$S$94,2,FALSE))","v":67745.16},"CH-Salaries-AfC8b-Q3","AfC 8b - Trainee Clinical Scientist (eg STP) - Internally Funded",{"$f":"IF(I166=\"XXX\",\"XXX\",IF($F395=\"NA\",\"XXX\",SUM(I166*$F395*'AfC Spine Data'!$V$5)))","v":"XXX"}]
[null,"8b",9,23,"Salaries-AfC8b-Q4",{"$f":"IF(ISERROR(VLOOKUP(CONCATENATE(B396,\"-\",VLOOKUP(C396,afcterms_table,D396,FALSE)),'AfC Spine Data'!$R$4:$S$94,2,FALSE))=TRUE,\"NA\",VLOOKUP(CONCATENATE(B396,\"-\",VLOOKUP(C396,afcterms_table,D396,FALSE)),'AfC Spine Data'!$R$4:$S$94,2,FALSE))","v":67745.16},"CH-Salaries-AfC8b-Q4","AfC 8b - Trainee Clinical Scientist (eg STP) - Externally Funded","XXX"]
[null,"8b",null,23,"Salaries-AfC8b-Q6",{"$f":"IF(ISERROR(VLOOKUP(CONCATENATE(B397,\"-\",VLOOKUP(C397,afcterms_table,D397,FALSE)),'AfC Spine Data'!$R$4:$S$94,2,FALSE))=TRUE,\"NA\",VLOOKUP(CONCATENATE(B397,\"-\",VLOOKUP(C397,afcterms_table,D397,FALSE)),'AfC Spine Data'!$R$4:$S$94,2,FALSE))","v":"NA"},"CH-Salaries-AfC8b-Q6","AfC 8b - Consultant Biomedical Scientist",{"$f":"IF(I168=\"XXX\",\"XXX\",IF($F397=\"NA\",\"XXX\",SUM(I168*$F397)))","v":"XXX"}]
[null,"8b",10,23,"Salaries-AfC8b-Q7",{"$f":"IF(ISERROR(VLOOKUP(CONCATENATE(B398,\"-\",VLOOKUP(C398,afcterms_table,D398,FALSE)),'AfC Spine Data'!$R$4:$S$94,2,FALSE))=TRUE,\"NA\",VLOOKUP(CONCATENATE(B398,\"-\",VLOOKUP(C398,afcterms_table,D398,FALSE)),'AfC Spine Data'!$R$4:$S$94,2,FALSE))","v":67745.16},"CH-Salaries-AfC8b-Q7","AfC 8b - Non Trainee Biomedical Scientist",{"$f":"IF(I169=\"XXX\",\"XXX\",IF($F398=\"NA\",\"XXX\",SUM(I169*$F398)))","v":"XXX"}]
[null,"8b",11,23,"Salaries-AfC8b-Q8",{"$f":"IF(ISERROR(VLOOKUP(CONCATENATE(B399,\"-\",VLOOKUP(C399,afcterms_table,D399,FALSE)),'AfC Spine Data'!$R$4:$S$94,2,FALSE))=TRUE,\"NA\",VLOOKUP(CONCATENATE(B399,\"-\",VLOOKUP(C399,afcterms_table,D399,FALSE)),'AfC Spine Data'!$R$4:$S$94,2,FALSE))","v":67745.16},"CH-Salaries-AfC8b-Q8","AfC 8b - Trainee Biomedical Scientist - Internally Funded",{"$f":"IF(I170=\"XXX\",\"XXX\",IF($F399=\"NA\",\"XXX\",SUM(I170*$F399*'AfC Spine Data'!$V$6)))","v":"XXX"}]
[null,"8b",12,23,"Salaries-AfC8b-Q9",{"$f":"IF(ISERROR(VLOOKUP(CONCATENATE(B400,\"-\",VLOOKUP(C400,afcterms_table,D400,FALSE)),'AfC Spine Data'!$R$4:$S$94,2,FALSE))=TRUE,\"NA\",VLOOKUP(CONCATENATE(B400,\"-\",VLOOKUP(C400,afcterms_table,D400,FALSE)),'AfC Spine Data'!$R$4:$S$94,2,FALSE))","v":67745.16},"CH-Salaries-AfC8b-Q9","AfC 8b - Trainee Biomedical Scientist - Externally Funded","XXX"]
[null,"8b",13,23,"Salaries-AfC8b-Q11",{"$f":"IF(ISERROR(VLOOKUP(CONCATENATE(B401,\"-\",VLOOKUP(C401,afcterms_table,D401,FALSE)),'AfC Spine Data'!$R$4:$S$94,2,FALSE))=TRUE,\"NA\",VLOOKUP(CONCATENATE(B401,\"-\",VLOOKUP(C401,afcterms_table,D401,FALSE)),'AfC Spine Data'!$R$4:$S$94,2,FALSE))","v":67745.16},"CH-Salaries-AfC8b-Q11","AfC 8b - Laboratory Support Worker/Medical Laboratory Assistant (MLA)",{"$f":"IF(I172=\"XXX\",\"XXX\",IF($F401=\"NA\",\"XXX\",SUM(I172*$F401)))","v":"XXX"}]
[null,"8b",14,23,"Salaries-AfC8b-Q12",{"$f":"IF(ISERROR(VLOOKUP(CONCATENATE(B402,\"-\",VLOOKUP(C402,afcterms_table,D402,FALSE)),'AfC Spine Data'!$R$4:$S$94,2,FALSE))=TRUE,\"NA\",VLOOKUP(CONCATENATE(B402,\"-\",VLOOKUP(C402,afcterms_table,D402,FALSE)),'AfC Spine Data'!$R$4:$S$94,2,FALSE))","v":67745.16},"CH-Salaries-AfC8b-Q12","AfC 8b - Associate Practitioner",{"$f":"IF(I173=\"XXX\",\"XXX\",IF($F402=\"NA\",\"XXX\",SUM(I173*$F402)))","v":"XXX"}]
[null,"8b",15,23,"Salaries-AfC8b-Q28",{"$f":"IF(ISERROR(VLOOKUP(CONCATENATE(B403,\"-\",VLOOKUP(C403,afcterms_table,D403,FALSE)),'AfC Spine Data'!$R$4:$S$94,2,FALSE))=TRUE,\"NA\",VLOOKUP(CONCATENATE(B403,\"-\",VLOOKUP(C403,afcterms_table,D403,FALSE)),'AfC Spine Data'!$R$4:$S$94,2,FALSE))","v":67745.16},"CH-Salaries-AfC8b-Q28","AfC 8b - Cytoscreeners",{"$f":"IF(I174=\"XXX\",\"XXX\",IF($F403=\"NA\",\"XXX\",SUM(I174*$F403)))","v":"XXX"}]
[null,"8b",16,23,"Salaries-AfC8b-Q14",{"$f":"IF(ISERROR(VLOOKUP(CONCATENATE(B404,\"-\",VLOOKUP(C404,afcterms_table,D404,FALSE)),'AfC Spine Data'!$R$4:$S$94,2,FALSE))=TRUE,\"NA\",VLOOKUP(CONCATENATE(B404,\"-\",VLOOKUP(C404,afcterms_table,D404,FALSE)),'AfC Spine Data'!$R$4:$S$94,2,FALSE))","v":67745.16},"CH-Salaries-AfC8b-Q14","AfC 8b - Administrative and Clerical Staff",{"$f":"IF(I175=\"XXX\",\"XXX\",IF($F404=\"NA\",\"XXX\",SUM(I175*$F404)))","v":"XXX"}]
[null,"8b",17,23,"Salaries-AfC8b-Q15",{"$f":"IF(ISERROR(VLOOKUP(CONCATENATE(B405,\"-\",VLOOKUP(C405,afcterms_table,D405,FALSE)),'AfC Spine Data'!$R$4:$S$94,2,FALSE))=TRUE,\"NA\",VLOOKUP(CONCATENATE(B405,\"-\",VLOOKUP(C405,afcterms_table,D405,FALSE)),'AfC Spine Data'!$R$4:$S$94,2,FALSE))","v":67745.16},"CH-Salaries-AfC8b-Q15","AfC 8b - Management Staff (Include Clinical Director, Finance Director, Lab Manager etc)",{"$f":"IF(I176=\"XXX\",\"XXX\",IF($F405=\"NA\",\"XXX\",SUM(I176*$F405)))","v":"XXX"}]
[null,"8b",18,23,"Salaries-AfC8b-Q16",{"$f":"IF(ISERROR(VLOOKUP(CONCATENATE(B406,\"-\",VLOOKUP(C406,afcterms_table,D406,FALSE)),'AfC Spine Data'!$R$4:$S$94,2,FALSE))=TRUE,\"NA\",VLOOKUP(CONCATENATE(B406,\"-\",VLOOKUP(C406,afcterms_table,D406,FALSE)),'AfC Spine Data'!$R$4:$S$94,2,FALSE))","v":67745.16},"CH-Salaries-AfC8b-Q16","AfC 8b - Quality Managers",{"$f":"IF(I177=\"XXX\",\"XXX\",IF($F406=\"NA\",\"XXX\",SUM(I177*$F406)))","v":"XXX"}]
[null,"8b",19,23,"Salaries-AfC8b-Q17",{"$f":"IF(ISERROR(VLOOKUP(CONCATENATE(B407,\"-\",VLOOKUP(C407,afcterms_table,D407,FALSE)),'AfC Spine Data'!$R$4:$S$94,2,FALSE))=TRUE,\"NA\",VLOOKUP(CONCATENATE(B407,\"-\",VLOOKUP(C407,afcterms_table,D407,FALSE)),'AfC Spine Data'!$R$4:$S$94,2,FALSE))","v":67745.16},"CH-Salaries-AfC8b-Q17","AfC 8b - IT Staff",{"$f":"IF(I178=\"XXX\",\"XXX\",IF($F407=\"NA\",\"XXX\",SUM(I178*$F407)))","v":"XXX"}]
[null,"8b",20,23,"Salaries-AfC8b-Q18",{"$f":"IF(ISERROR(VLOOKUP(CONCATENATE(B408,\"-\",VLOOKUP(C408,afcterms_table,D408,FALSE)),'AfC Spine Data'!$R$4:$S$94,2,FALSE))=TRUE,\"NA\",VLOOKUP(CONCATENATE(B408,\"-\",VLOOKUP(C408,afcterms_table,D408,FALSE)),'AfC Spine Data'!$R$4:$S$94,2,FALSE))","v":67745.16},"CH-Salaries-AfC8b-Q18","AfC 8b - Remaning Other Staff",{"$f":"IF(I179=\"XXX\",\"XXX\",IF($F408=\"NA\",\"XXX\",SUM(I179*$F408)))","v":"XXX"}]
[null,"8b",21,23,"Salaries-AfC8b-Q20",{"$f":"IF(ISERROR(VLOOKUP(CONCATENATE(B409,\"-\",VLOOKUP(C409,afcterms_table,D409,FALSE)),'AfC Spine Data'!$R$4:$S$94,2,FALSE))=TRUE,\"NA\",VLOOKUP(CONCATENATE(B409,\"-\",VLOOKUP(C409,afcterms_table,D409,FALSE)),'AfC Spine Data'!$R$4:$S$94,2,FALSE))","v":"NA"},"CH-Salaries-AfC8b-Q20","AfC 8b - Total",{"$f":"IF(SUM(I393,I394,I395,I396,I398,I399,I400,I401,I402,I403,I404,I405,I406,I407,I408)=0,\"XXX\",SUM(I393,I394,I395,I396,I398,I399,I400,I401,I402,I403,I404,I405,I406,I407,I408))","v":"XXX"}]
[null,"8c",6,23,"Salaries-AfC8c-Q1",{"$f":"IF(ISERROR(VLOOKUP(CONCATENATE(B410,\"-\",VLOOKUP(C410,afcterms_table,D410,FALSE)),'AfC Spine Data'!$R$4:$S$94,2,FALSE))=TRUE,\"NA\",VLOOKUP(CONCATENATE(B410,\"-\",VLOOKUP(C410,afcterms_table,D410,FALSE)),'AfC Spine Data'!$R$4:$S$94,2,FALSE))","v":79661.61},"CH-Salaries-AfC8c-Q1","AfC 8c - Consultant Clinical Scientist",{"$f":"IF(I181=\"XXX\",\"XXX\",IF($F410=\"NA\",\"XXX\",SUM(I181*$F410)))","v":"XXX"}]
[null,"8c",7,23,"Salaries-AfC8c-Q2",{"$f":"IF(ISERROR(VLOOKUP(CONCATENATE(B411,\"-\",VLOOKUP(C411,afcterms_table,D411,FALSE)),'AfC Spine Data'!$R$4:$S$94,2,FALSE))=TRUE,\"NA\",VLOOKUP(CONCATENATE(B411,\"-\",VLOOKUP(C411,afcterms_table,D411,FALSE)),'AfC Spine Data'!$R$4:$S$94,2,FALSE))","v":79661.61},"CH-Salaries-AfC8c-Q2","AfC 8c - Non-Trainee, Non-Consultant Clinical Scientist",{"$f":"IF(I182=\"XXX\",\"XXX\",IF($F411=\"NA\",\"XXX\",SUM(I182*$F411)))","v":"XXX"}]
[null,"8c",8,23,"Salaries-AfC8c-Q3",{"$f":"IF(ISERROR(VLOOKUP(CONCATENATE(B412,\"-\",VLOOKUP(C412,afcterms_table,D412,FALSE)),'AfC Spine Data'!$R$4:$S$94,2,FALSE))=TRUE,\"NA\",VLOOKUP(CONCATENATE(B412,\"-\",VLOOKUP(C412,afcterms_table,D412,FALSE)),'AfC Spine Data'!$R$4:$S$94,2,FALSE))","v":79661.61},"CH-Salaries-AfC8c-Q3","AfC 8c - Trainee Clinical Scientist (eg STP) - Internally Funded",{"$f":"IF(I183=\"XXX\",\"XXX\",IF($F412=\"NA\",\"XXX\",SUM(I183*$F412*'AfC Spine Data'!$V$5)))","v":"XXX"}]
[null,"8c",9,23,"Salaries-AfC8c-Q4",{"$f":"IF(ISERROR(VLOOKUP(CONCATENATE(B413,\"-\",VLOOKUP(C413,afcterms_table,D413,FALSE)),'AfC Spine Data'!$R$4:$S$94,2,FALSE))=TRUE,\"NA\",VLOOKUP(CONCATENATE(B413,\"-\",VLOOKUP(C413,afcterms_table,D413,FALSE)),'AfC Spine Data'!$R$4:$S$94,2,FALSE))","v":79661.61},"CH-Salaries-AfC8c-Q4","AfC 8c - Trainee Clinical Scientist (eg STP) - Externally Funded","XXX"]
[null,"8c",null,23,"Salaries-AfC8c-Q6",{"$f":"IF(ISERROR(VLOOKUP(CONCATENATE(B414,\"-\",VLOOKUP(C414,afcterms_table,D414,FALSE)),'AfC Spine Data'!$R$4:$S$94,2,FALSE))=TRUE,\"NA\",VLOOKUP(CONCATENATE(B414,\"-\",VLOOKUP(C414,afcterms_table,D414,FALSE)),'AfC Spine Data'!$R$4:$S$94,2,FALSE))","v":"NA"},"CH-Salaries-AfC8c-Q6","AfC 8c - Consultant Biomedical Scientist",{"$f":"IF(I185=\"XXX\",\"XXX\",IF($F414=\"NA\",\"XXX\",SUM(I185*$F414)))","v":"XXX"}]
[null,"8c",10,23,"Salaries-AfC8c-Q7",{"$f":"IF(ISERROR(VLOOKUP(CONCATENATE(B415,\"-\",VLOOKUP(C415,afcterms_table,D415,FALSE)),'AfC Spine Data'!$R$4:$S$94,2,FALSE))=TRUE,\"NA\",VLOOKUP(CONCATENATE(B415,\"-\",VLOOKUP(C415,afcterms_table,D415,FALSE)),'AfC Spine Data'!$R$4:$S$94,2,FALSE))","v":79661.61},"CH-Salaries-AfC8c-Q7","AfC 8c - Non Trainee Biomedical Scientist",{"$f":"IF(I186=\"XXX\",\"XXX\",IF($F415=\"NA\",\"XXX\",SUM(I186*$F415)))","v":"XXX"}]
[null,"8c",11,23,"Salaries-AfC8c-Q8",{"$f":"IF(ISERROR(VLOOKUP(CONCATENATE(B416,\"-\",VLOOKUP(C416,afcterms_table,D416,FALSE)),'AfC Spine Data'!$R$4:$S$94,2,FALSE))=TRUE,\"NA\",VLOOKUP(CONCATENATE(B416,\"-\",VLOOKUP(C416,afcterms_table,D416,FALSE)),'AfC Spine Data'!$R$4:$S$94,2,FALSE))","v":79661.61},"CH-Salaries-AfC8c-Q8","AfC 8c - Trainee Biomedical Scientist - Internally Funded",{"$f":"IF(I187=\"XXX\",\"XXX\",IF($F416=\"NA\",\"XXX\",SUM(I187*$F416*'AfC Spine Data'!$V$6)))","v":"XXX"}]
[null,"8c",12,23,"Salaries-AfC8c-Q9",{"$f":"IF(ISERROR(VLOOKUP(CONCATENATE(B417,\"-\",VLOOKUP(C417,afcterms_table,D417,FALSE)),'AfC Spine Data'!$R$4:$S$94,2,FALSE))=TRUE,\"NA\",VLOOKUP(CONCATENATE(B417,\"-\",VLOOKUP(C417,afcterms_table,D417,FALSE)),'AfC Spine Data'!$R$4:$S$94,2,FALSE))","v":79661.61},"CH-Salaries-AfC8c-Q9","AfC 8c - Trainee Biomedical Scientist - Externally Funded","XXX"]
[null,"8c",13,23,"Salaries-AfC8c-Q11",{"$f":"IF(ISERROR(VLOOKUP(CONCATENATE(B418,\"-\",VLOOKUP(C418,afcterms_table,D418,FALSE)),'AfC Spine Data'!$R$4:$S$94,2,FALSE))=TRUE,\"NA\",VLOOKUP(CONCATENATE(B418,\"-\",VLOOKUP(C418,afcterms_table,D418,FALSE)),'AfC Spine Data'!$R$4:$S$94,2,FALSE))","v":79661.61},"CH-Salaries-AfC8c-Q11","AfC 8c - Laboratory Support Worker/Medical Laboratory Assistant (MLA)",{"$f":"IF(I189=\"XXX\",\"XXX\",IF($F418=\"NA\",\"XXX\",SUM(I189*$F418)))","v":"XXX"}]
[null,"8c",14,23,"Salaries-AfC8c-Q12",{"$f":"IF(ISERROR(VLOOKUP(CONCATENATE(B419,\"-\",VLOOKUP(C419,afcterms_table,D419,FALSE)),'AfC Spine Data'!$R$4:$S$94,2,FALSE))=TRUE,\"NA\",VLOOKUP(CONCATENATE(B419,\"-\",VLOOKUP(C419,afcterms_table,D419,FALSE)),'AfC Spine Data'!$R$4:$S$94,2,FALSE))","v":79661.61},"CH-Salaries-AfC8c-Q12","AfC 8c - Associate Practitioner",{"$f":"IF(I190=\"XXX\",\"XXX\",IF($F419=\"NA\",\"XXX\",SUM(I190*$F419)))","v":"XXX"}]
[null,"8c",15,23,"Salaries-AfC8c-Q28",{"$f":"IF(ISERROR(VLOOKUP(CONCATENATE(B420,\"-\",VLOOKUP(C420,afcterms_table,D420,FALSE)),'AfC Spine Data'!$R$4:$S$94,2,FALSE))=TRUE,\"NA\",VLOOKUP(CONCATENATE(B420,\"-\",VLOOKUP(C420,afcterms_table,D420,FALSE)),'AfC Spine Data'!$R$4:$S$94,2,FALSE))","v":79661.61},"CH-Salaries-AfC8c-Q28","AfC 8c - Cytoscreeners",{"$f":"IF(I191=\"XXX\",\"XXX\",IF($F420=\"NA\",\"XXX\",SUM(I191*$F420)))","v":"XXX"}]
[null,"8c",16,23,"Salaries-AfC8c-Q14",{"$f":"IF(ISERROR(VLOOKUP(CONCATENATE(B421,\"-\",VLOOKUP(C421,afcterms_table,D421,FALSE)),'AfC Spine Data'!$R$4:$S$94,2,FALSE))=TRUE,\"NA\",VLOOKUP(CONCATENATE(B421,\"-\",VLOOKUP(C421,afcterms_table,D421,FALSE)),'AfC Spine Data'!$R$4:$S$94,2,FALSE))","v":79661.61},"CH-Salaries-AfC8c-Q14","AfC 8c - Administrative and Clerical Staff",{"$f":"IF(I192=\"XXX\",\"XXX\",IF($F421=\"NA\",\"XXX\",SUM(I192*$F421)))","v":"XXX"}]
[null,"8c",17,23,"Salaries-AfC8c-Q15",{"$f":"IF(ISERROR(VLOOKUP(CONCATENATE(B422,\"-\",VLOOKUP(C422,afcterms_table,D422,FALSE)),'AfC Spine Data'!$R$4:$S$94,2,FALSE))=TRUE,\"NA\",VLOOKUP(CONCATENATE(B422,\"-\",VLOOKUP(C422,afcterms_table,D422,FALSE)),'AfC Spine Data'!$R$4:$S$94,2,FALSE))","v":79661.61},"CH-Salaries-AfC8c-Q15","AfC 8c - Management Staff (Include Clinical Director, Finance Director, Lab Manager etc)",{"$f":"IF(I193=\"XXX\",\"XXX\",IF($F422=\"NA\",\"XXX\",SUM(I193*$F422)))","v":"XXX"}]
[null,"8c",18,23,"Salaries-AfC8c-Q16",{"$f":"IF(ISERROR(VLOOKUP(CONCATENATE(B423,\"-\",VLOOKUP(C423,afcterms_table,D423,FALSE)),'AfC Spine Data'!$R$4:$S$94,2,FALSE))=TRUE,\"NA\",VLOOKUP(CONCATENATE(B423,\"-\",VLOOKUP(C423,afcterms_table,D423,FALSE)),'AfC Spine Data'!$R$4:$S$94,2,FALSE))","v":79661.61},"CH-Salaries-AfC8c-Q16","AfC 8c - Quality Managers",{"$f":"IF(I194=\"XXX\",\"XXX\",IF($F423=\"NA\",\"XXX\",SUM(I194*$F423)))","v":"XXX"}]
[null,"8c",19,23,"Salaries-AfC8c-Q17",{"$f":"IF(ISERROR(VLOOKUP(CONCATENATE(B424,\"-\",VLOOKUP(C424,afcterms_table,D424,FALSE)),'AfC Spine Data'!$R$4:$S$94,2,FALSE))=TRUE,\"NA\",VLOOKUP(CONCATENATE(B424,\"-\",VLOOKUP(C424,afcterms_table,D424,FALSE)),'AfC Spine Data'!$R$4:$S$94,2,FALSE))","v":79661.61},"CH-Salaries-AfC8c-Q17","AfC 8c - IT Staff",{"$f":"IF(I195=\"XXX\",\"XXX\",IF($F424=\"NA\",\"XXX\",SUM(I195*$F424)))","v":"XXX"}]
[null,"8c",20,23,"Salaries-AfC8c-Q18",{"$f":"IF(ISERROR(VLOOKUP(CONCATENATE(B425,\"-\",VLOOKUP(C425,afcterms_table,D425,FALSE)),'AfC Spine Data'!$R$4:$S$94,2,FALSE))=TRUE,\"NA\",VLOOKUP(CONCATENATE(B425,\"-\",VLOOKUP(C425,afcterms_table,D425,FALSE)),'AfC Spine Data'!$R$4:$S$94,2,FALSE))","v":79661.61},"CH-Salaries-AfC8c-Q18","AfC 8c - Remaning Other Staff",{"$f":"IF(I196=\"XXX\",\"XXX\",IF($F425=\"NA\",\"XXX\",SUM(I196*$F425)))","v":"XXX"}]
[null,"8c",21,23,"Salaries-AfC8c-Q20",{"$f":"IF(ISERROR(VLOOKUP(CONCATENATE(B426,\"-\",VLOOKUP(C426,afcterms_table,D426,FALSE)),'AfC Spine Data'!$R$4:$S$94,2,FALSE))=TRUE,\"NA\",VLOOKUP(CONCATENATE(B426,\"-\",VLOOKUP(C426,afcterms_table,D426,FALSE)),'AfC Spine Data'!$R$4:$S$94,2,FALSE))","v":"NA"},"CH-Salaries-AfC8c-Q20","AfC 8c - Total",{"$f":"IF(SUM(I410,I411,I412,I413,I415,I416,I417,I418,I419,I420,I421,I422,I423,I424,I425)=0,\"XXX\",SUM(I410,I411,I412,I413,I415,I416,I417,I418,I419,I420,I421,I422,I423,I424,I425))","v":"XXX"}]
[null,"8d",6,23,"Salaries-AfC8d-Q1",{"$f":"IF(ISERROR(VLOOKUP(CONCATENATE(B427,\"-\",VLOOKUP(C427,afcterms_table,D427,FALSE)),'AfC Spine Data'!$R$4:$S$94,2,FALSE))=TRUE,\"NA\",VLOOKUP(CONCATENATE(B427,\"-\",VLOOKUP(C427,afcterms_table,D427,FALSE)),'AfC Spine Data'!$R$4:$S$94,2,FALSE))","v":95436.18},{"$f":"CONCATENATE($F$2,\"-\",E427)","v":"CH-Salaries-AfC8d-Q1"},"AfC 8d - Consultant Clinical Scientist",{"$f":"IF(I198=\"XXX\",\"XXX\",IF($F427=\"NA\",\"XXX\",SUM(I198*$F427)))","v":"XXX"}]
[null,"8d",7,23,"Salaries-AfC8d-Q2",{"$f":"IF(ISERROR(VLOOKUP(CONCATENATE(B428,\"-\",VLOOKUP(C428,afcterms_table,D428,FALSE)),'AfC Spine Data'!$R$4:$S$94,2,FALSE))=TRUE,\"NA\",VLOOKUP(CONCATENATE(B428,\"-\",VLOOKUP(C428,afcterms_table,D428,FALSE)),'AfC Spine Data'!$R$4:$S$94,2,FALSE))","v":95436.18},"CH-Salaries-AfC8d-Q2","AfC 8d - Non-Trainee, Non-Consultant Clinical Scientist",{"$f":"IF(I199=\"XXX\",\"XXX\",IF($F428=\"NA\",\"XXX\",SUM(I199*$F428)))","v":"XXX"}]
[null,"8d",8,23,"Salaries-AfC8d-Q3",{"$f":"IF(ISERROR(VLOOKUP(CONCATENATE(B429,\"-\",VLOOKUP(C429,afcterms_table,D429,FALSE)),'AfC Spine Data'!$R$4:$S$94,2,FALSE))=TRUE,\"NA\",VLOOKUP(CONCATENATE(B429,\"-\",VLOOKUP(C429,afcterms_table,D429,FALSE)),'AfC Spine Data'!$R$4:$S$94,2,FALSE))","v":95436.18},"CH-Salaries-AfC8d-Q3","AfC 8d - Trainee Clinical Scientist (eg STP) - Internally Funded",{"$f":"IF(I200=\"XXX\",\"XXX\",IF($F429=\"NA\",\"XXX\",SUM(I200*$F429*'AfC Spine Data'!$V$5)))","v":"XXX"}]
[null,"8d",9,23,"Salaries-AfC8d-Q4",{"$f":"IF(ISERROR(VLOOKUP(CONCATENATE(B430,\"-\",VLOOKUP(C430,afcterms_table,D430,FALSE)),'AfC Spine Data'!$R$4:$S$94,2,FALSE))=TRUE,\"NA\",VLOOKUP(CONCATENATE(B430,\"-\",VLOOKUP(C430,afcterms_table,D430,FALSE)),'AfC Spine Data'!$R$4:$S$94,2,FALSE))","v":95436.18},"CH-Salaries-AfC8d-Q4","AfC 8d - Trainee Clinical Scientist (eg STP) - Externally Funded","XXX"]
[null,"8d",null,23,"Salaries-AfC8d-Q6",{"$f":"IF(ISERROR(VLOOKUP(CONCATENATE(B431,\"-\",VLOOKUP(C431,afcterms_table,D431,FALSE)),'AfC Spine Data'!$R$4:$S$94,2,FALSE))=TRUE,\"NA\",VLOOKUP(CONCATENATE(B431,\"-\",VLOOKUP(C431,afcterms_table,D431,FALSE)),'AfC Spine Data'!$R$4:$S$94,2,FALSE))","v":"NA"},"CH-Salaries-AfC8d-Q6","AfC 8d - Consultant Biomedical Scientist",{"$f":"IF(I202=\"XXX\",\"XXX\",IF($F431=\"NA\",\"XXX\",SUM(I202*$F431)))","v":"XXX"}]
[null,"8d",10,23,"Salaries-AfC8d-Q7",{"$f":"IF(ISERROR(VLOOKUP(CONCATENATE(B432,\"-\",VLOOKUP(C432,afcterms_table,D432,FALSE)),'AfC Spine Data'!$R$4:$S$94,2,FALSE))=TRUE,\"NA\",VLOOKUP(CONCATENATE(B432,\"-\",VLOOKUP(C432,afcterms_table,D432,FALSE)),'AfC Spine Data'!$R$4:$S$94,2,FALSE))","v":95436.18},"CH-Salaries-AfC8d-Q7","AfC 8d - Non Trainee Biomedical Scientist",{"$f":"IF(I203=\"XXX\",\"XXX\",IF($F432=\"NA\",\"XXX\",SUM(I203*$F432)))","v":"XXX"}]
[null,"8d",11,23,"Salaries-AfC8d-Q8",{"$f":"IF(ISERROR(VLOOKUP(CONCATENATE(B433,\"-\",VLOOKUP(C433,afcterms_table,D433,FALSE)),'AfC Spine Data'!$R$4:$S$94,2,FALSE))=TRUE,\"NA\",VLOOKUP(CONCATENATE(B433,\"-\",VLOOKUP(C433,afcterms_table,D433,FALSE)),'AfC Spine Data'!$R$4:$S$94,2,FALSE))","v":95436.18},"CH-Salaries-AfC8d-Q8","AfC 8d - Trainee Biomedical Scientist - Internally Funded",{"$f":"IF(I204=\"XXX\",\"XXX\",IF($F433=\"NA\",\"XXX\",SUM(I204*$F433*'AfC Spine Data'!$V$6)))","v":"XXX"}]
[null,"8d",12,23,"Salaries-AfC8d-Q9",{"$f":"IF(ISERROR(VLOOKUP(CONCATENATE(B434,\"-\",VLOOKUP(C434,afcterms_table,D434,FALSE)),'AfC Spine Data'!$R$4:$S$94,2,FALSE))=TRUE,\"NA\",VLOOKUP(CONCATENATE(B434,\"-\",VLOOKUP(C434,afcterms_table,D434,FALSE)),'AfC Spine Data'!$R$4:$S$94,2,FALSE))","v":95436.18},"CH-Salaries-AfC8d-Q9","AfC 8d - Trainee Biomedical Scientist - Externally Funded","XXX"]
[null,"8d",13,23,"Salaries-AfC8d-Q11",{"$f":"IF(ISERROR(VLOOKUP(CONCATENATE(B435,\"-\",VLOOKUP(C435,afcterms_table,D435,FALSE)),'AfC Spine Data'!$R$4:$S$94,2,FALSE))=TRUE,\"NA\",VLOOKUP(CONCATENATE(B435,\"-\",VLOOKUP(C435,afcterms_table,D435,FALSE)),'AfC Spine Data'!$R$4:$S$94,2,FALSE))","v":95436.18},"CH-Salaries-AfC8d-Q11","AfC 8d - Laboratory Support Worker/Medical Laboratory Assistant (MLA)",{"$f":"IF(I206=\"XXX\",\"XXX\",IF($F435=\"NA\",\"XXX\",SUM(I206*$F435)))","v":"XXX"}]
[null,"8d",14,23,"Salaries-AfC8d-Q12",{"$f":"IF(ISERROR(VLOOKUP(CONCATENATE(B436,\"-\",VLOOKUP(C436,afcterms_table,D436,FALSE)),'AfC Spine Data'!$R$4:$S$94,2,FALSE))=TRUE,\"NA\",VLOOKUP(CONCATENATE(B436,\"-\",VLOOKUP(C436,afcterms_table,D436,FALSE)),'AfC Spine Data'!$R$4:$S$94,2,FALSE))","v":95436.18},"CH-Salaries-AfC8d-Q12","AfC 8d - Associate Practitioner",{"$f":"IF(I207=\"XXX\",\"XXX\",IF($F436=\"NA\",\"XXX\",SUM(I207*$F436)))","v":"XXX"}]
[null,"8d",15,23,"Salaries-AfC8d-Q28",{"$f":"IF(ISERROR(VLOOKUP(CONCATENATE(B437,\"-\",VLOOKUP(C437,afcterms_table,D437,FALSE)),'AfC Spine Data'!$R$4:$S$94,2,FALSE))=TRUE,\"NA\",VLOOKUP(CONCATENATE(B437,\"-\",VLOOKUP(C437,afcterms_table,D437,FALSE)),'AfC Spine Data'!$R$4:$S$94,2,FALSE))","v":95436.18},"CH-Salaries-AfC8d-Q28","AfC 8d - Cytoscreeners",{"$f":"IF(I208=\"XXX\",\"XXX\",IF($F437=\"NA\",\"XXX\",SUM(I208*$F437)))","v":"XXX"}]
[null,"8d",16,23,"Salaries-AfC8d-Q14",{"$f":"IF(ISERROR(VLOOKUP(CONCATENATE(B438,\"-\",VLOOKUP(C438,afcterms_table,D438,FALSE)),'AfC Spine Data'!$R$4:$S$94,2,FALSE))=TRUE,\"NA\",VLOOKUP(CONCATENATE(B438,\"-\",VLOOKUP(C438,afcterms_table,D438,FALSE)),'AfC Spine Data'!$R$4:$S$94,2,FALSE))","v":95436.18},"CH-Salaries-AfC8d-Q14","AfC 8d - Administrative and Clerical Staff",{"$f":"IF(I209=\"XXX\",\"XXX\",IF($F438=\"NA\",\"XXX\",SUM(I209*$F438)))","v":"XXX"}]
[null,"8d",17,23,"Salaries-AfC8d-Q15",{"$f":"IF(ISERROR(VLOOKUP(CONCATENATE(B439,\"-\",VLOOKUP(C439,afcterms_table,D439,FALSE)),'AfC Spine Data'!$R$4:$S$94,2,FALSE))=TRUE,\"NA\",VLOOKUP(CONCATENATE(B439,\"-\",VLOOKUP(C439,afcterms_table,D439,FALSE)),'AfC Spine Data'!$R$4:$S$94,2,FALSE))","v":95436.18},"CH-Salaries-AfC8d-Q15","AfC 8d - Management Staff (Include Clinical Director, Finance Director, Lab Manager etc)",{"$f":"IF(I210=\"XXX\",\"XXX\",IF($F439=\"NA\",\"XXX\",SUM(I210*$F439)))","v":"XXX"}]
[null,"8d",18,23,"Salaries-AfC8d-Q16",{"$f":"IF(ISERROR(VLOOKUP(CONCATENATE(B440,\"-\",VLOOKUP(C440,afcterms_table,D440,FALSE)),'AfC Spine Data'!$R$4:$S$94,2,FALSE))=TRUE,\"NA\",VLOOKUP(CONCATENATE(B440,\"-\",VLOOKUP(C440,afcterms_table,D440,FALSE)),'AfC Spine Data'!$R$4:$S$94,2,FALSE))","v":95436.18},"CH-Salaries-AfC8d-Q16","AfC 8d - Quality Managers",{"$f":"IF(I211=\"XXX\",\"XXX\",IF($F440=\"NA\",\"XXX\",SUM(I211*$F440)))","v":"XXX"}]
[null,"8d",19,23,"Salaries-AfC8d-Q17",{"$f":"IF(ISERROR(VLOOKUP(CONCATENATE(B441,\"-\",VLOOKUP(C441,afcterms_table,D441,FALSE)),'AfC Spine Data'!$R$4:$S$94,2,FALSE))=TRUE,\"NA\",VLOOKUP(CONCATENATE(B441,\"-\",VLOOKUP(C441,afcterms_table,D441,FALSE)),'AfC Spine Data'!$R$4:$S$94,2,FALSE))","v":95436.18},"CH-Salaries-AfC8d-Q17","AfC 8d - IT Staff",{"$f":"IF(I212=\"XXX\",\"XXX\",IF($F441=\"NA\",\"XXX\",SUM(I212*$F441)))","v":"XXX"}]
[null,"8d",20,23,"Salaries-AfC8d-Q18",{"$f":"IF(ISERROR(VLOOKUP(CONCATENATE(B442,\"-\",VLOOKUP(C442,afcterms_table,D442,FALSE)),'AfC Spine Data'!$R$4:$S$94,2,FALSE))=TRUE,\"NA\",VLOOKUP(CONCATENATE(B442,\"-\",VLOOKUP(C442,afcterms_table,D442,FALSE)),'AfC Spine Data'!$R$4:$S$94,2,FALSE))","v":95436.18},"CH-Salaries-AfC8d-Q18","AfC 8d - Remaning Other Staff",{"$f":"IF(I213=\"XXX\",\"XXX\",IF($F442=\"NA\",\"XXX\",SUM(I213*$F442)))","v":"XXX"}]
[null,"8d",21,23,"Salaries-AfC8d-Q20",{"$f":"IF(ISERROR(VLOOKUP(CONCATENATE(B443,\"-\",VLOOKUP(C443,afcterms_table,D443,FALSE)),'AfC Spine Data'!$R$4:$S$94,2,FALSE))=TRUE,\"NA\",VLOOKUP(CONCATENATE(B443,\"-\",VLOOKUP(C443,afcterms_table,D443,FALSE)),'AfC Spine Data'!$R$4:$S$94,2,FALSE))","v":"NA"},"CH-Salaries-AfC8d-Q20","AfC 8d - Total",{"$f":"IF(SUM(I427,I428,I429,I430,I432,I433,I434,I435,I436,I437,I438,I439,I440,I441,I442)=0,\"XXX\",SUM(I427,I428,I429,I430,I432,I433,I434,I435,I436,I437,I438,I439,I440,I441,I442))","v":"XXX"}]
[null,"9",6,23,"Salaries-AfC9-Q1",{"$f":"IF(ISERROR(VLOOKUP(CONCATENATE(B444,\"-\",VLOOKUP(C444,afcterms_table,D444,FALSE)),'AfC Spine Data'!$R$4:$S$94,2,FALSE))=TRUE,\"NA\",VLOOKUP(CONCATENATE(B444,\"-\",VLOOKUP(C444,afcterms_table,D444,FALSE)),'AfC Spine Data'!$R$4:$S$94,2,FALSE))","v":115524.36},"CH-Salaries-AfC9-Q1","AfC 9 - Consultant Clinical Scientist",{"$f":"IF(I215=\"XXX\",\"XXX\",IF($F444=\"NA\",\"XXX\",SUM(I215*$F444)))","v":"XXX"}]
[null,"9",7,23,"Salaries-AfC9-Q2",{"$f":"IF(ISERROR(VLOOKUP(CONCATENATE(B445,\"-\",VLOOKUP(C445,afcterms_table,D445,FALSE)),'AfC Spine Data'!$R$4:$S$94,2,FALSE))=TRUE,\"NA\",VLOOKUP(CONCATENATE(B445,\"-\",VLOOKUP(C445,afcterms_table,D445,FALSE)),'AfC Spine Data'!$R$4:$S$94,2,FALSE))","v":115524.36},"CH-Salaries-AfC9-Q2","AfC 9 - Non-Trainee, Non-Consultant Clinical Scientist",{"$f":"IF(I216=\"XXX\",\"XXX\",IF($F445=\"NA\",\"XXX\",SUM(I216*$F445)))","v":"XXX"}]
[null,"9",8,23,"Salaries-AfC9-Q3",{"$f":"IF(ISERROR(VLOOKUP(CONCATENATE(B446,\"-\",VLOOKUP(C446,afcterms_table,D446,FALSE)),'AfC Spine Data'!$R$4:$S$94,2,FALSE))=TRUE,\"NA\",VLOOKUP(CONCATENATE(B446,\"-\",VLOOKUP(C446,afcterms_table,D446,FALSE)),'AfC Spine Data'!$R$4:$S$94,2,FALSE))","v":115524.36},"CH-Salaries-AfC9-Q3","AfC 9 - Trainee Clinical Scientist (eg STP) - Internally Funded",{"$f":"IF(I217=\"XXX\",\"XXX\",IF($F446=\"NA\",\"XXX\",SUM(I217*$F446*'AfC Spine Data'!$V$5)))","v":"XXX"}]
[null,"9",9,23,"Salaries-AfC9-Q4",{"$f":"IF(ISERROR(VLOOKUP(CONCATENATE(B447,\"-\",VLOOKUP(C447,afcterms_table,D447,FALSE)),'AfC Spine Data'!$R$4:$S$94,2,FALSE))=TRUE,\"NA\",VLOOKUP(CONCATENATE(B447,\"-\",VLOOKUP(C447,afcterms_table,D447,FALSE)),'AfC Spine Data'!$R$4:$S$94,2,FALSE))","v":115524.36},"CH-Salaries-AfC9-Q4","AfC 9 - Trainee Clinical Scientist (eg STP) - Externally Funded","XXX"]
[null,"9",null,23,"Salaries-AfC9-Q6",{"$f":"IF(ISERROR(VLOOKUP(CONCATENATE(B448,\"-\",VLOOKUP(C448,afcterms_table,D448,FALSE)),'AfC Spine Data'!$R$4:$S$94,2,FALSE))=TRUE,\"NA\",VLOOKUP(CONCATENATE(B448,\"-\",VLOOKUP(C448,afcterms_table,D448,FALSE)),'AfC Spine Data'!$R$4:$S$94,2,FALSE))","v":"NA"},"CH-Salaries-AfC9-Q6","AfC 9 - Consultant Biomedical Scientist",{"$f":"IF(I219=\"XXX\",\"XXX\",IF($F448=\"NA\",\"XXX\",SUM(I219*$F448)))","v":"XXX"}]
[null,"9",10,23,"Salaries-AfC9-Q7",{"$f":"IF(ISERROR(VLOOKUP(CONCATENATE(B449,\"-\",VLOOKUP(C449,afcterms_table,D449,FALSE)),'AfC Spine Data'!$R$4:$S$94,2,FALSE))=TRUE,\"NA\",VLOOKUP(CONCATENATE(B449,\"-\",VLOOKUP(C449,afcterms_table,D449,FALSE)),'AfC Spine Data'!$R$4:$S$94,2,FALSE))","v":115524.36},"CH-Salaries-AfC9-Q7","AfC 9 - Non Trainee Biomedical Scientist",{"$f":"IF(I220=\"XXX\",\"XXX\",IF($F449=\"NA\",\"XXX\",SUM(I220*$F449)))","v":"XXX"}]
[null,"9",11,23,"Salaries-AfC9-Q8",{"$f":"IF(ISERROR(VLOOKUP(CONCATENATE(B450,\"-\",VLOOKUP(C450,afcterms_table,D450,FALSE)),'AfC Spine Data'!$R$4:$S$94,2,FALSE))=TRUE,\"NA\",VLOOKUP(CONCATENATE(B450,\"-\",VLOOKUP(C450,afcterms_table,D450,FALSE)),'AfC Spine Data'!$R$4:$S$94,2,FALSE))","v":115524.36},"CH-Salaries-AfC9-Q8","AfC 9 - Trainee Biomedical Scientist - Internally Funded",{"$f":"IF(I221=\"XXX\",\"XXX\",IF($F450=\"NA\",\"XXX\",SUM(I221*$F450*'AfC Spine Data'!$V$6)))","v":"XXX"}]
[null,"9",12,23,"Salaries-AfC9-Q9",{"$f":"IF(ISERROR(VLOOKUP(CONCATENATE(B451,\"-\",VLOOKUP(C451,afcterms_table,D451,FALSE)),'AfC Spine Data'!$R$4:$S$94,2,FALSE))=TRUE,\"NA\",VLOOKUP(CONCATENATE(B451,\"-\",VLOOKUP(C451,afcterms_table,D451,FALSE)),'AfC Spine Data'!$R$4:$S$94,2,FALSE))","v":115524.36},"CH-Salaries-AfC9-Q9","AfC 9 - Trainee Biomedical Scientist - Externally Funded","XXX"]
[null,"9",13,23,"Salaries-AfC9-Q11",{"$f":"IF(ISERROR(VLOOKUP(CONCATENATE(B452,\"-\",VLOOKUP(C452,afcterms_table,D452,FALSE)),'AfC Spine Data'!$R$4:$S$94,2,FALSE))=TRUE,\"NA\",VLOOKUP(CONCATENATE(B452,\"-\",VLOOKUP(C452,afcterms_table,D452,FALSE)),'AfC Spine Data'!$R$4:$S$94,2,FALSE))","v":115524.36},"CH-Salaries-AfC9-Q11","AfC 9 - Laboratory Support Worker/Medical Laboratory Assistant (MLA)",{"$f":"IF(I223=\"XXX\",\"XXX\",IF($F452=\"NA\",\"XXX\",SUM(I223*$F452)))","v":"XXX"}]
[null,"9",14,23,"Salaries-AfC9-Q12",{"$f":"IF(ISERROR(VLOOKUP(CONCATENATE(B453,\"-\",VLOOKUP(C453,afcterms_table,D453,FALSE)),'AfC Spine Data'!$R$4:$S$94,2,FALSE))=TRUE,\"NA\",VLOOKUP(CONCATENATE(B453,\"-\",VLOOKUP(C453,afcterms_table,D453,FALSE)),'AfC Spine Data'!$R$4:$S$94,2,FALSE))","v":115524.36},"CH-Salaries-AfC9-Q12","AfC 9 - Associate Practitioner",{"$f":"IF(I224=\"XXX\",\"XXX\",IF($F453=\"NA\",\"XXX\",SUM(I224*$F453)))","v":"XXX"}]
[null,"9",15,23,"Salaries-AfC9-Q28",{"$f":"IF(ISERROR(VLOOKUP(CONCATENATE(B454,\"-\",VLOOKUP(C454,afcterms_table,D454,FALSE)),'AfC Spine Data'!$R$4:$S$94,2,FALSE))=TRUE,\"NA\",VLOOKUP(CONCATENATE(B454,\"-\",VLOOKUP(C454,afcterms_table,D454,FALSE)),'AfC Spine Data'!$R$4:$S$94,2,FALSE))","v":115524.36},"CH-Salaries-AfC9-Q28","AfC 9 - Cytoscreeners",{"$f":"IF(I225=\"XXX\",\"XXX\",IF($F454=\"NA\",\"XXX\",SUM(I225*$F454)))","v":"XXX"}]
[null,"9",16,23,"Salaries-AfC9-Q14",{"$f":"IF(ISERROR(VLOOKUP(CONCATENATE(B455,\"-\",VLOOKUP(C455,afcterms_table,D455,FALSE)),'AfC Spine Data'!$R$4:$S$94,2,FALSE))=TRUE,\"NA\",VLOOKUP(CONCATENATE(B455,\"-\",VLOOKUP(C455,afcterms_table,D455,FALSE)),'AfC Spine Data'!$R$4:$S$94,2,FALSE))","v":115524.36},"CH-Salaries-AfC9-Q14","AfC 9 - Administrative and Clerical Staff",{"$f":"IF(I226=\"XXX\",\"XXX\",IF($F455=\"NA\",\"XXX\",SUM(I226*$F455)))","v":"XXX"}]
[null,"9",17,23,"Salaries-AfC9-Q15",{"$f":"IF(ISERROR(VLOOKUP(CONCATENATE(B456,\"-\",VLOOKUP(C456,afcterms_table,D456,FALSE)),'AfC Spine Data'!$R$4:$S$94,2,FALSE))=TRUE,\"NA\",VLOOKUP(CONCATENATE(B456,\"-\",VLOOKUP(C456,afcterms_table,D456,FALSE)),'AfC Spine Data'!$R$4:$S$94,2,FALSE))","v":115524.36},"CH-Salaries-AfC9-Q15","AfC 9 - Management Staff (Include Clinical Director, Finance Director, Lab Manager etc)",{"$f":"IF(I227=\"XXX\",\"XXX\",IF($F456=\"NA\",\"XXX\",SUM(I227*$F456)))","v":"XXX"}]
[null,"9",18,23,"Salaries-AfC9-Q16",{"$f":"IF(ISERROR(VLOOKUP(CONCATENATE(B457,\"-\",VLOOKUP(C457,afcterms_table,D457,FALSE)),'AfC Spine Data'!$R$4:$S$94,2,FALSE))=TRUE,\"NA\",VLOOKUP(CONCATENATE(B457,\"-\",VLOOKUP(C457,afcterms_table,D457,FALSE)),'AfC Spine Data'!$R$4:$S$94,2,FALSE))","v":115524.36},"CH-Salaries-AfC9-Q16","AfC 9 - Quality Managers",{"$f":"IF(I228=\"XXX\",\"XXX\",IF($F457=\"NA\",\"XXX\",SUM(I228*$F457)))","v":"XXX"}]
[null,"9",19,23,"Salaries-AfC9-Q17",{"$f":"IF(ISERROR(VLOOKUP(CONCATENATE(B458,\"-\",VLOOKUP(C458,afcterms_table,D458,FALSE)),'AfC Spine Data'!$R$4:$S$94,2,FALSE))=TRUE,\"NA\",VLOOKUP(CONCATENATE(B458,\"-\",VLOOKUP(C458,afcterms_table,D458,FALSE)),'AfC Spine Data'!$R$4:$S$94,2,FALSE))","v":115524.36},"CH-Salaries-AfC9-Q17","AfC 9 - IT Staff",{"$f":"IF(I229=\"XXX\",\"XXX\",IF($F458=\"NA\",\"XXX\",SUM(I229*$F458)))","v":"XXX"}]
[null,"9",20,23,"Salaries-AfC9-Q18",{"$f":"IF(ISERROR(VLOOKUP(CONCATENATE(B459,\"-\",VLOOKUP(C459,afcterms_table,D459,FALSE)),'AfC Spine Data'!$R$4:$S$94,2,FALSE))=TRUE,\"NA\",VLOOKUP(CONCATENATE(B459,\"-\",VLOOKUP(C459,afcterms_table,D459,FALSE)),'AfC Spine Data'!$R$4:$S$94,2,FALSE))","v":115524.36},"CH-Salaries-AfC9-Q18","AfC 9 - Remaning Other Staff",{"$f":"IF(I230=\"XXX\",\"XXX\",IF($F459=\"NA\",\"XXX\",SUM(I230*$F459)))","v":"XXX"}]
[null,"9",21,23,"Salaries-AfC9-Q20",{"$f":"IF(ISERROR(VLOOKUP(CONCATENATE(B460,\"-\",VLOOKUP(C460,afcterms_table,D460,FALSE)),'AfC Spine Data'!$R$4:$S$94,2,FALSE))=TRUE,\"NA\",VLOOKUP(CONCATENATE(B460,\"-\",VLOOKUP(C460,afcterms_table,D460,FALSE)),'AfC Spine Data'!$R$4:$S$94,2,FALSE))","v":"NA"},"CH-Salaries-AfC9-Q20","AfC 9 - Total",{"$f":"IF(SUM(I444,I445,I446,I447,I449,I450,I451,I452,I453,I454,I455,I456,I457,I458,I459)=0,\"XXX\",SUM(I444,I445,I446,I447,I449,I450,I451,I452,I453,I454,I455,I456,I457,I458,I459))","v":"XXX"}]
[]
[null,null,null,null,"Finance-NonPay-Q1",{"$f":"CONCATENATE($F$2,\"-\",E462)","v":"CH-Finance-NonPay-Q1"},"CH-Finance-NonPay-Q1","Total Non Pay",{"$f":"'Staffing and Finance Data Entry'!D12","v":0}]
[null,null,null,null,"Finance-NonPay-Q2","CH-Finance-NonPay-Q2","CH-Finance-NonPay-Q2","Total Expenditure",{"$f":"IF(I462=0,0,IF(I256=0,0,SUM(I256,I462)))","v":0}]
[]
[]
[null,null,null,null,null,null,null,"Turnaround Times"]
[null,null,null,null,null,null,"TaT-Q1-1","Proportion of requests from A&E for U&E (or equivalent) reported within one hour of sample collection",{"$f":"'Turnaround Times'!C11","v":0}]
[null,null,null,null,null,null,"TaT-Q1-2","Proportion of requests from A&E for U&E (or equivalent) reported within one hour of receipt in the laboratory",{"$f":"'Turnaround Times'!C12","v":0}]
[null,null,null,null,null,null,"TaT-Q1-3","What is your average turnaround time (in minutes) for U&E (or equivalent) requests from A&E? (Please use 95th percentile as your average)",{"$f":"'Turnaround Times'!C13","v":0}]
[null,null,null,null,null,null,"TaT-Q1-4","What is your target turnaround time (in minutes) for U&E (or equivalent) requests from A&E?",{"$f":"'Turnaround Times'!C14","v":0}]
[null,null,null,null,null,null,"TaT-Q2-1","Proportion of requests from A&E for Troponin reported within one hour of sample collection",{"$f":"'Turnaround Times'!C17","v":0}]
[null,null,null,null,null,null,"TaT-Q2-2","Proportion of requests from A&E for Troponin reported within one hour of receipt in the laboratory",{"$f":"'Turnaround Times'!C18","v":0}]
[null,null,null,null,null,null,"TaT-Q2-3","What is your average turnaround time (in minutes) for Troponin requests from A&E? (Please use 95th percentile as your average)",{"$f":"'Turnaround Times'!C19","v":0}]
[null,null,null,null,null,null,"TaT-Q2-4","What is your target turnaround time (in minutes) for Troponin requests from A&E?",{"$f":"'Turnaround Times'!C20","v":0}]
[null,null,null,null,null,null,"TaT-Q3-1","Proportion of requests from A&E for Full Blood Count reported within one hour of sample collection",{"$f":"'Turnaround Times'!#REF!","v":{"$error":"#REF!"}}]
[null,null,null,null,null,null,"TaT-Q3-2","Proportion of requests from A&E for Full Blood Count reported within one hour of receipt in the laboratory",{"$f":"'Turnaround Times'!#REF!","v":{"$error":"#REF!"}}]
[null,null,null,null,null,null,"TaT-Q3-3","What is your average turnaround time (in minutes) for Full Blood Count requests from A&E? (Please use 95th percentile as your average)",{"$f":"'Turnaround Times'!#REF!","v":{"$error":"#REF!"}}]
[null,null,null,null,null,null,"TaT-Q3-4","What is your target turnaround time (in minutes) for Full Blood Count requests from A&E?",{"$f":"'Turnaround Times'!#REF!","v":{"$error":"#REF!"}}]
[null,null,null,null,null,null,"TaT-Q4-1","Proportion of requests from A&E for Coagulation Screen reported within one hour of sample collection",{"$f":"'Turnaround Times'!#REF!","v":{"$error":"#REF!"}}]
[null,null,null,null,null,null,"TaT-Q4-2","Proportion of requests from A&E for Coagulation Screen reported within one hour of receipt in the laboratory",{"$f":"'Turnaround Times'!#REF!","v":{"$error":"#REF!"}}]
[null,null,null,null,null,null,"TaT-Q4-3","What is your average turnaround time (in minutes) for Coagulation Screen requests from A&E? (Please use 95th percentile as your average)",{"$f":"'Turnaround Times'!#REF!","v":{"$error":"#REF!"}}]
[null,null,null,null,null,null,"TaT-Q4-4","What is your target turnaround time (in minutes) for Coagulation Screen requests from A&E?",{"$f":"'Turnaround Times'!#REF!","v":{"$error":"#REF!"}}]
[null,null,null,null,null,null,"TaT-Q6-1","Proportion of ANA screens reported within 72 hours of receipt in the laboratory",{"$f":"'Turnaround Times'!#REF!","v":{"$error":"#REF!"}}]
[null,null,null,null,null,null,"TaT-Q6-2","What is your average turnaround time (in hours) for ANA Screens? (Please use 95th percentile as your average)",{"$f":"'Turnaround Times'!#REF!","v":{"$error":"#REF!"}}]
[null,null,null,null,null,null,"TaT-Q6-3","What is your target turnaround time (in hours) for ANA Screens?",{"$f":"'Turnaround Times'!#REF!","v":{"$error":"#REF!"}}]
[null,null,null,null,null,null,"TaT-Q7-1","Proportion of IgG Level tests reported within 48 hours of receipt in the laboratory",{"$f":"'Turnaround Times'!#REF!","v":{"$error":"#REF!"}}]
[null,null,null,null,null,null,"TaT-Q7-2","What is your average turnaround time (in hours) for IgG Level tests? (Please use 95th percentile as your average)",{"$f":"'Turnaround Times'!#REF!","v":{"$error":"#REF!"}}]
[null,null,null,null,null,null,"TaT-Q7-3","What is your target turnaround time (in hours) for IgG Level tests?",{"$f":"'Turnaround Times'!#REF!","v":{"$error":"#REF!"}}]
[null,null,null,null,null,null,"TaT-Q8-1","Proportion of Total IgE Level tests reported within 120 hours of receipt in the laboratory",{"$f":"'Turnaround Times'!#REF!","v":{"$error":"#REF!"}}]
[null,null,null,null,null,null,"TaT-Q8-2","What is your average turnaround time (in hours) for Total IgE Level tests? (Please use 95th percentile as your average)",{"$f":"'Turnaround Times'!#REF!","v":{"$error":"#REF!"}}]
[null,null,null,null,null,null,"TaT-Q8-3","What is your target turnaround time (in hours) for Total IgE Level tests?",{"$f":"'Turnaround Times'!#REF!","v":{"$error":"#REF!"}}]
[null,null,null,null,null,null,"TaT-Q9-1","Proportion of CD4 Count tests reported within 48 hours of receipt in the laboratory",{"$f":"'Turnaround Times'!#REF!","v":{"$error":"#REF!"}}]
[null,null,null,null,null,null,"TaT-Q9-2","What is your average turnaround time (in hours) for CD4 Count tests? (Please use 95th percentile as your average)",{"$f":"'Turnaround Times'!#REF!","v":{"$error":"#REF!"}}]
[null,null,null,null,null,null,"TaT-Q9-3","What is your target turnaround time (in hours) for CD4 Count tests?",{"$f":"'Turnaround Times'!#REF!","v":{"$error":"#REF!"}}]
[null,null,null,null,null,null,"TaT-Q10-1","Proportion of ANCA tests reported within 72 hours of receipt in the laboratory",{"$f":"'Turnaround Times'!#REF!","v":{"$error":"#REF!"}}]
[null,null,null,null,null,null,"TaT-Q10-2","What is your average turnaround time (in hours) for ANCA tests? (Please use 95th percentile as your average)",{"$f":"'Turnaround Times'!#REF!","v":{"$error":"#REF!"}}]
[null,null,null,null,null,null,"TaT-Q10-3","What is your target turnaround time (in hours) for ANCA tests?",{"$f":"'Turnaround Times'!#REF!","v":{"$error":"#REF!"}}]
[null,null,null,null,null,null,"TaT-Q11-1","Proportion of Coeliac tests reported within 72 hours of receipt in the laboratory",{"$f":"'Turnaround Times'!#REF!","v":{"$error":"#REF!"}}]
[null,null,null,null,null,null,"TaT-Q11-2","What is your average turnaround time (in hours) for Coeliac tests? (Please use 95th percentile as your average)",{"$f":"'Turnaround Times'!#REF!","v":{"$error":"#REF!"}}]
[null,null,null,null,null,null,"TaT-Q11-3","What is your target turnaround time (in hours) for Coeliac tests?",{"$f":"'Turnaround Times'!#REF!","v":{"$error":"#REF!"}}]
[null,null,null,null,null,null,"TaT-Q12-1","Proportion of requests for routine antenatal screening tests reported within five working days from sample collection",{"$f":"'Turnaround Times'!#REF!","v":{"$error":"#REF!"}}]
[null,null,null,null,null,null,"TaT-Q12-2","Proportion of requests for routine antenatal screening tests reported within five working days of receipt in the laboratory (eight days for samples that have to be sent to another laboratory for confirmatory testing)",{"$f":"'Turnaround Times'!#REF!","v":{"$error":"#REF!"}}]
[null,null,null,null,null,null,"TaT-Q12-3","What is your average turnaround time (in working days) for routine antenatal screening tests? (Please use 95th percentile as your average)",{"$f":"'Turnaround Times'!#REF!","v":{"$error":"#REF!"}}]
[null,null,null,null,null,null,"TaT-Q12-4","What is your target turnaround time (in working days) for routine antenatal screening tests?",{"$f":"'Turnaround Times'!#REF!","v":{"$error":"#REF!"}}]
[null,null,null,null,null,null,"TaT-Q13-1","Proportion of requests for late presentation antenatal screening tests reported within 24 hours of sample collection",{"$f":"'Turnaround Times'!#REF!","v":{"$error":"#REF!"}}]
[null,null,null,null,null,null,"TaT-Q13-2","Proportion of requests for late presentation antenatal screening tests reported within 24 hours of receipt in the laboratory",{"$f":"'Turnaround Times'!#REF!","v":{"$error":"#REF!"}}]
[null,null,null,null,null,null,"TaT-Q13-3","What is your average turnaround time (in days) for late presentation antenatal screening tests? (Please use 95th percentile as your average)",{"$f":"'Turnaround Times'!#REF!","v":{"$error":"#REF!"}}]
[null,null,null,null,null,null,"TaT-Q13-4","What is your target turnaround time (in days) for late presentation antenatal screening tests?",{"$f":"'Turnaround Times'!#REF!","v":{"$error":"#REF!"}}]
[null,null,null,null,null,null,"TaT-Q14-1","Proportion of requests for C-Difficile requests reported within 24 hours of receipt into the laboratory",{"$f":"'Turnaround Times'!#REF!","v":{"$error":"#REF!"}}]
[null,null,null,null,null,null,"TaT-Q14-2","Average turnaround time in days for C-Difficile request (from receipt in the laboratory)",{"$f":"'Turnaround Times'!#REF!","v":{"$error":"#REF!"}}]
[null,null,null,null,null,null,"TaT-Q14-3","What is your target turnaround time in days for C-Difficile requests (from receipt in the laboratory)",{"$f":"'Turnaround Times'!#REF!","v":{"$error":"#REF!"}}]
[null,null,null,null,null,null,"TaT-Q15-1","Average turnaround time in days for MRSA request (from receipt in the laboratory)",{"$f":"'Turnaround Times'!#REF!","v":{"$error":"#REF!"}}]
[null,null,null,null,null,null,"TaT-Q15-2","What is your target turnaround time in days for MRSA requests (from receipt in the laboratory)",{"$f":"'Turnaround Times'!#REF!","v":{"$error":"#REF!"}}]
[null,null,null,null,null,null,"TaT-Q17-1","Proportion of requests for breast needle core biopsy reported within 7 calendar days from sample collection",{"$f":"'Turnaround Times'!#REF!","v":{"$error":"#REF!"}}]
[null,null,null,null,null,null,"TaT-Q17-2","Proportion of requests for breast needle core biopsy reported within 7 calendar days from receipt in lab",{"$f":"'Turnaround Times'!#REF!","v":{"$error":"#REF!"}}]
[null,null,null,null,null,null,"TaT-Q17-3","Proportion of requests for breast needle core biopsy reported within 10 calendar days from sample collection",{"$f":"'Turnaround Times'!#REF!","v":{"$error":"#REF!"}}]
[null,null,null,null,null,null,"TaT-Q17-4","Proportion of requests for breast needle core biopsy reported within 10 calendar days from receipt in lab",{"$f":"'Turnaround Times'!#REF!","v":{"$error":"#REF!"}}]
[null,null,null,null,null,null,"TaT-Q18-1","Proportion of requests for Colorectal Endoscopic Biopsy reported within 7 calendar days from sample collection",{"$f":"'Turnaround Times'!#REF!","v":{"$error":"#REF!"}}]
[null,null,null,null,null,null,"TaT-Q18-2","Proportion of requests for Colorectal Endoscopic Biopsy reported within 7 calendar days from receipt in lab",{"$f":"'Turnaround Times'!#REF!","v":{"$error":"#REF!"}}]
[null,null,null,null,null,null,"TaT-Q18-3","Proportion of requests for Colorectal Endoscopic Biopsy reported within 10 calendar days from sample collection",{"$f":"'Turnaround Times'!#REF!","v":{"$error":"#REF!"}}]
[null,null,null,null,null,null,"TaT-Q18-4","Proportion of requests for Colorectal Endoscopic Biopsy reported within 10 calendar days from receipt in lab",{"$f":"'Turnaround Times'!#REF!","v":{"$error":"#REF!"}}]
[null,null,null,null,null,null,"TaT-Q19-1","Proportion of requests for Prostate Needle Core Biopsy reported within 7 calendar days from sample collection",{"$f":"'Turnaround Times'!#REF!","v":{"$error":"#REF!"}}]
[null,null,null,null,null,null,"TaT-Q19-2","Proportion of requests for Prostate Needle Core Biopsy reported within 7 calendar days from receipt in lab",{"$f":"'Turnaround Times'!#REF!","v":{"$error":"#REF!"}}]
[null,null,null,null,null,null,"TaT-Q19-3","Proportion of requests for Prostate Needle Core Biopsy reported within 10 calendar days from sample collection",{"$f":"'Turnaround Times'!#REF!","v":{"$error":"#REF!"}}]
[null,null,null,null,null,null,"TaT-Q19-4","Proportion of requests for Prostate Needle Core Biopsy reported within 10 calendar days from receipt in lab",{"$f":"'Turnaround Times'!#REF!","v":{"$error":"#REF!"}}]
[null,null,null,null,null,null,"TaT-Q20-1","Proportion of requests for Cervical Cytology Preparations reported within 14 calendar days from sample collection",{"$f":"'Turnaround Times'!#REF!","v":{"$error":"#REF!"}}]
[null,null,null,null,null,null,"TaT-Q20-2","Proportion of requests for Cervical Cytology Preparations reported within 14 calendar days from receipt in lab",{"$f":"'Turnaround Times'!#REF!","v":{"$error":"#REF!"}}]
[null,null,null,null,null,null,"TaT-Q20-3","Proportion of requests for Cervical Cytology Preparations reported within 35 calendar days from sample collection",{"$f":"'Turnaround Times'!#REF!","v":{"$error":"#REF!"}}]
[null,null,null,null,null,null,"TaT-Q20-4","Proportion of requests for Cervical Cytology Preparations reported within 35 calendar days from receipt in lab",{"$f":"'Turnaround Times'!#REF!","v":{"$error":"#REF!"}}]
[]
[]
[null,null,null,null,null,null,null,"WORKLOAD"]
[null,null,null,1,{"$f":"IF($F$2=\"HI\",\"Workload-Source-QR\",IF($F$2=\"CY\",\"Workload-Source-QR\",\"Workload-Source-QT\"))","v":"Workload-Source-QT"},null,{"$f":"CONCATENATE(E533,VLOOKUP($F$2,lists!$H$3:$I$10,2,FALSE),\"-\",D533)","v":"Workload-Source-QT1-1"},"Source of Workload: Hospitals/laboratories within your overall Trust/Organisation",{"$f":"'Workload Data Entry'!C7","v":0}]
[null,null,null,2,{"$f":"IF($F$2=\"HI\",\"Workload-Source-QR\",IF($F$2=\"CY\",\"Workload-Source-QR\",\"Workload-Source-QT\"))","v":"Workload-Source-QT"},null,{"$f":"CONCATENATE(E534,VLOOKUP($F$2,lists!$H$3:$I$10,2,FALSE),\"-\",D534)","v":"Workload-Source-QT1-2"},"Source of Workload: Other NHS hospitals/laboratories within your network*",{"$f":"'Workload Data Entry'!C8","v":0}]
[null,null,null,3,"Workload-Source-QT",null,{"$f":"CONCATENATE(E535,VLOOKUP($F$2,lists!$H$3:$I$10,2,FALSE),\"-\",D535)","v":"Workload-Source-QT1-3"},"Source of Workload: Other NHS hospitals/laboratories outside your network",{"$f":"'Workload Data Entry'!C9","v":0}]
[null,null,null,4,"Workload-Source-QT",null,{"$f":"CONCATENATE(E536,VLOOKUP($F$2,lists!$H$3:$I$10,2,FALSE),\"-\",D536)","v":"Workload-Source-QT1-4"},"Source of Workload: Private/non-NHS work",{"$f":"'Workload Data Entry'!C10","v":0}]
[null,null,null,5,"Workload-Source-QT",null,{"$f":"CONCATENATE(E537,VLOOKUP($F$2,lists!$H$3:$I$10,2,FALSE),\"-\",D537)","v":"Workload-Source-QT1-5"},"Source of Workload: Primary care/GP tests",{"$f":"'Workload Data Entry'!C11","v":0}]
[null,null,null,6,"Workload-Source-QT",null,{"$f":"CONCATENATE(E538,VLOOKUP($F$2,lists!$H$3:$I$10,2,FALSE),\"-\",D538)","v":"Workload-Source-QT1-6"},"Source of Workload: Any other not listed above",{"$f":"'Workload Data Entry'!C12","v":0}]
[null,null,null,7,"Workload-Source-QT",null,{"$f":"CONCATENATE(E539,VLOOKUP($F$2,lists!$H$3:$I$10,2,FALSE),\"-\",D539)","v":"Workload-Source-QT1-7"},"Source of Workload: Total",{"$f":"SUM(I533:I538)","v":0}]
[]
[null,null,null,null,"Workload-Tests-Q1-",null,{"$f":"CONCATENATE(E541,VLOOKUP($F$2,lists!$H$3:$I$10,2,FALSE))","v":"Workload-Tests-Q1-1"},"Total Tests",{"$f":"'Summary Data Sense Check Sheet'!C10","v":0}]
[null,null,null,null,"Workload-Tests-Q2-",null,{"$f":"CONCATENATE(E542,VLOOKUP($F$2,lists!$H$3:$I$10,2,FALSE))","v":"Workload-Tests-Q2-1"},"Total Tests Referred Out",{"$f":"'Summary Data Sense Check Sheet'!D10","v":0}]
[null,null,null,null,null,null,"CH-TotalTestsInHouse","Total Tests In-House",{"$f":"'Summary Data Sense Check Sheet'!E10","v":0}]
[]
[null,null,null,null,null,null,"Workload-Individual-TotalTests-Q1-1-1","Total Tests - Plasma/Serum/Blood - 1,25 Hydroxy Vitamin D",{"$f":"'Workload Data Entry'!C29","v":0}]
[null,null,null,null,null,null,"Workload-Individual-TotalTests-Q1-1-2","Total Tests - Plasma/Serum/Blood - 11-Deoxycortisol",{"$f":"'Workload Data Entry'!C30","v":0}]
[null,null,null,null,null,null,"Workload-Individual-TotalTests-Q1-1-3","Total Tests - Plasma/Serum/Blood - 17 Hydroxy Progesterone",{"$f":"'Workload Data Entry'!C31","v":0}]
[null,null,null,null,null,null,"Workload-Individual-TotalTests-Q1-1-4","Total Tests - Plasma/Serum/Blood - 25 Hydroxy Vitamin D",{"$f":"'Workload Data Entry'!C32","v":0}]
[null,null,null,null,null,null,"Workload-Individual-TotalTests-Q1-1-5","Total Tests - Plasma/Serum/Blood - ACTH",{"$f":"'Workload Data Entry'!C33","v":0}]
[null,null,null,null,null,null,"Workload-Individual-TotalTests-Q1-1-6","Total Tests - Plasma/Serum/Blood - Acyl Carnitine",{"$f":"'Workload Data Entry'!C34","v":0}]
[null,null,null,null,null,null,"Workload-Individual-TotalTests-Q1-1-7","Total Tests - Plasma/Serum/Blood - Adrenaline",{"$f":"'Workload Data Entry'!C35","v":0}]
[null,null,null,null,null,null,"Workload-Individual-TotalTests-Q1-1-8","Total Tests - Plasma/Serum/Blood - Albumin",{"$f":"'Workload Data Entry'!C36","v":0}]
[null,null,null,null,null,null,"Workload-Individual-TotalTests-Q1-1-9","Total Tests - Plasma/Serum/Blood - Alcohol (Ethanol)",{"$f":"'Workload Data Entry'!C37","v":0}]
[null,null,null,null,null,null,"Workload-Individual-TotalTests-Q1-1-10","Total Tests - Plasma/Serum/Blood - Aldosterone",{"$f":"'Workload Data Entry'!C38","v":0}]
[null,null,null,null,null,null,"Workload-Individual-TotalTests-Q1-1-11","Total Tests - Plasma/Serum/Blood - Alkaline phosphatase",{"$f":"'Workload Data Entry'!C39","v":0}]
[null,null,null,null,null,null,"Workload-Individual-TotalTests-Q1-1-12","Total Tests - Plasma/Serum/Blood - Alkaline phosphatase isoenzymes",{"$f":"'Workload Data Entry'!C40","v":0}]
[null,null,null,null,null,null,"Workload-Individual-TotalTests-Q1-1-13","Total Tests - Plasma/Serum/Blood - Alpha 1 Antitrypsin",{"$f":"'Workload Data Entry'!C41","v":0}]
[null,null,null,null,null,null,"Workload-Individual-TotalTests-Q1-1-14","Total Tests - Plasma/Serum/Blood - Alpha 1 Antitrypsin Phenotype",{"$f":"'Workload Data Entry'!C42","v":0}]
[null,null,null,null,null,null,"Workload-Individual-TotalTests-Q1-1-15","Total Tests - Plasma/Serum/Blood - Alpha-fetoprotein (non-Downs)",{"$f":"'Workload Data Entry'!C43","v":0}]
[null,null,null,null,null,null,"Workload-Individual-TotalTests-Q1-1-16","Total Tests - Plasma/Serum/Blood - ALT",{"$f":"'Workload Data Entry'!C44","v":0}]
[null,null,null,null,null,null,"Workload-Individual-TotalTests-Q1-1-17","Total Tests - Plasma/Serum/Blood - Aluminium",{"$f":"'Workload Data Entry'!C45","v":0}]
[null,null,null,null,null,null,"Workload-Individual-TotalTests-Q1-1-18","Total Tests - Plasma/Serum/Blood - Amino Acids",{"$f":"'Workload Data Entry'!C46","v":0}]
[null,null,null,null,null,null,"Workload-Individual-TotalTests-Q1-1-19","Total Tests - Plasma/Serum/Blood - Amiodarone",{"$f":"'Workload Data Entry'!C47","v":0}]
[null,null,null,null,null,null,"Workload-Individual-TotalTests-Q1-1-20","Total Tests - Plasma/Serum/Blood - Amitryptiline",{"$f":"'Workload Data Entry'!C48","v":0}]
[null,null,null,null,null,null,"Workload-Individual-TotalTests-Q1-1-21","Total Tests - Plasma/Serum/Blood - Ammonia",{"$f":"'Workload Data Entry'!C49","v":0}]
[null,null,null,null,null,null,"Workload-Individual-TotalTests-Q1-1-22","Total Tests - Plasma/Serum/Blood - Amylase",{"$f":"'Workload Data Entry'!C50","v":0}]
[null,null,null,null,null,null,"Workload-Individual-TotalTests-Q1-1-23","Total Tests - Plasma/Serum/Blood - Androstenedione",{"$f":"'Workload Data Entry'!C51","v":0}]
[null,null,null,null,null,null,"Workload-Individual-TotalTests-Q1-1-24","Total Tests - Plasma/Serum/Blood - Angiotensin Converting Enzyme",{"$f":"'Workload Data Entry'!C52","v":0}]
[null,null,null,null,null,null,"Workload-Individual-TotalTests-Q1-1-25","Total Tests - Plasma/Serum/Blood - Anti Mullerian hormone",{"$f":"'Workload Data Entry'!C53","v":0}]
[null,null,null,null,null,null,"Workload-Individual-TotalTests-Q1-1-26","Total Tests - Plasma/Serum/Blood - Anti thyroid peroxidase antibodies (TPO)",{"$f":"'Workload Data Entry'!C54","v":0}]
[null,null,null,null,null,null,"Workload-Individual-TotalTests-Q1-1-27","Total Tests - Plasma/Serum/Blood - Antibiotics (Gentamycin)",{"$f":"'Workload Data Entry'!C55","v":0}]
[null,null,null,null,null,null,"Workload-Individual-TotalTests-Q1-1-28","Total Tests - Plasma/Serum/Blood - Antibiotics (Other)",{"$f":"'Workload Data Entry'!C56","v":0}]
[null,null,null,null,null,null,"Workload-Individual-TotalTests-Q1-1-29","Total Tests - Plasma/Serum/Blood - Antibiotics (Tobramycin)",{"$f":"'Workload Data Entry'!C57","v":0}]
[null,null,null,null,null,null,"Workload-Individual-TotalTests-Q1-1-30","Total Tests - Plasma/Serum/Blood - Antibiotics (Vancomycin)",{"$f":"'Workload Data Entry'!C58","v":0}]
[null,null,null,null,null,null,"Workload-Individual-TotalTests-Q1-1-31","Total Tests - Plasma/Serum/Blood - Apo A1",{"$f":"'Workload Data Entry'!C59","v":0}]
[null,null,null,null,null,null,"Workload-Individual-TotalTests-Q1-1-32","Total Tests - Plasma/Serum/Blood - Apo B",{"$f":"'Workload Data Entry'!C60","v":0}]
[null,null,null,null,null,null,"Workload-Individual-TotalTests-Q1-1-33","Total Tests - Plasma/Serum/Blood - Apo E Genotype",{"$f":"'Workload Data Entry'!C61","v":0}]
[null,null,null,null,null,null,"Workload-Individual-TotalTests-Q1-1-34","Total Tests - Plasma/Serum/Blood - Arsenic",{"$f":"'Workload Data Entry'!C62","v":0}]
[null,null,null,null,null,null,"Workload-Individual-TotalTests-Q1-1-35","Total Tests - Plasma/Serum/Blood - Ascorbic acid (Leucocyte)",{"$f":"'Workload Data Entry'!C63","v":0}]
[null,null,null,null,null,null,"Workload-Individual-TotalTests-Q1-1-36","Total Tests - Plasma/Serum/Blood - AST",{"$f":"'Workload Data Entry'!C64","v":0}]
[null,null,null,null,null,null,"Workload-Individual-TotalTests-Q1-1-37","Total Tests - Plasma/Serum/Blood - B hydroxybutyrate",{"$f":"'Workload Data Entry'!C65","v":0}]
[null,null,null,null,null,null,"Workload-Individual-TotalTests-Q1-1-38","Total Tests - Plasma/Serum/Blood - B2 Microglobulin",{"$f":"'Workload Data Entry'!C66","v":0}]
[null,null,null,null,null,null,"Workload-Individual-TotalTests-Q1-1-39","Total Tests - Plasma/Serum/Blood - Bicarbonate",{"$f":"'Workload Data Entry'!C67","v":0}]
[null,null,null,null,null,null,"Workload-Individual-TotalTests-Q1-1-40","Total Tests - Plasma/Serum/Blood - Bile acids",{"$f":"'Workload Data Entry'!C68","v":0}]
[null,null,null,null,null,null,"Workload-Individual-TotalTests-Q1-1-41","Total Tests - Plasma/Serum/Blood - Bilirubin (Conjugated)",{"$f":"'Workload Data Entry'!C69","v":0}]
[null,null,null,null,null,null,"Workload-Individual-TotalTests-Q1-1-42","Total Tests - Plasma/Serum/Blood - Bilirubin (Total)",{"$f":"'Workload Data Entry'!C70","v":0}]
[null,null,null,null,null,null,"Workload-Individual-TotalTests-Q1-1-43","Total Tests - Plasma/Serum/Blood - Bismuth",{"$f":"'Workload Data Entry'!C71","v":0}]
[null,null,null,null,null,null,"Workload-Individual-TotalTests-Q1-1-44","Total Tests - Plasma/Serum/Blood - Blood Gas (count as 1 test, Exclude POCT)",{"$f":"'Workload Data Entry'!C72","v":0}]
[null,null,null,null,null,null,"Workload-Individual-TotalTests-Q1-1-45","Total Tests - Plasma/Serum/Blood - Blood Spot TSH",{"$f":"'Workload Data Entry'!C73","v":0}]
[null,null,null,null,null,null,"Workload-Individual-TotalTests-Q1-1-46","Total Tests - Plasma/Serum/Blood - BNP/NTproBNP",{"$f":"'Workload Data Entry'!C74","v":0}]
[null,null,null,null,null,null,"Workload-Individual-TotalTests-Q1-1-47","Total Tests - Plasma/Serum/Blood - Bone alkaline phosphatase",{"$f":"'Workload Data Entry'!C75","v":0}]
[null,null,null,null,null,null,"Workload-Individual-TotalTests-Q1-1-48","Total Tests - Plasma/Serum/Blood - CA 125",{"$f":"'Workload Data Entry'!C76","v":0}]
[null,null,null,null,null,null,"Workload-Individual-TotalTests-Q1-1-49","Total Tests - Plasma/Serum/Blood - CA 15-3",{"$f":"'Workload Data Entry'!C77","v":0}]
[null,null,null,null,null,null,"Workload-Individual-TotalTests-Q1-1-50","Total Tests - Plasma/Serum/Blood - CA 19-9",{"$f":"'Workload Data Entry'!C78","v":0}]
[null,null,null,null,null,null,"Workload-Individual-TotalTests-Q1-1-51","Total Tests - Plasma/Serum/Blood - Cadmium",{"$f":"'Workload Data Entry'!C79","v":0}]
[null,null,null,null,null,null,"Workload-Individual-TotalTests-Q1-1-52","Total Tests - Plasma/Serum/Blood - Caeruloplasmin",{"$f":"'Workload Data Entry'!C80","v":0}]
[null,null,null,null,null,null,"Workload-Individual-TotalTests-Q1-1-53","Total Tests - Plasma/Serum/Blood - Calcitonin",{"$f":"'Workload Data Entry'!C81","v":0}]
[null,null,null,null,null,null,"Workload-Individual-TotalTests-Q1-1-54","Total Tests - Plasma/Serum/Blood - Calcium",{"$f":"'Workload Data Entry'!C82","v":0}]
[null,null,null,null,null,null,"Workload-Individual-TotalTests-Q1-1-55","Total Tests - Plasma/Serum/Blood - Carbamazepine",{"$f":"'Workload Data Entry'!C83","v":0}]
[null,null,null,null,null,null,"Workload-Individual-TotalTests-Q1-1-56","Total Tests - Plasma/Serum/Blood - Carbohydrate Deficient transferrin",{"$f":"'Workload Data Entry'!C84","v":0}]
[null,null,null,null,null,null,"Workload-Individual-TotalTests-Q1-1-57","Total Tests - Plasma/Serum/Blood - Carboxyhaemoglobin",{"$f":"'Workload Data Entry'!C85","v":0}]
[null,null,null,null,null,null,"Workload-Individual-TotalTests-Q1-1-58","Total Tests - Plasma/Serum/Blood - Carotene",{"$f":"'Workload Data Entry'!C86","v":0}]
[null,null,null,null,null,null,"Workload-Individual-TotalTests-Q1-1-59","Total Tests - Plasma/Serum/Blood - Carotenoids (x1)",{"$f":"'Workload Data Entry'!C87","v":0}]
[null,null,null,null,null,null,"Workload-Individual-TotalTests-Q1-1-60","Total Tests - Plasma/Serum/Blood - CEA",{"$f":"'Workload Data Entry'!C88","v":0}]
[null,null,null,null,null,null,"Workload-Individual-TotalTests-Q1-1-61","Total Tests - Plasma/Serum/Blood - Chloride",{"$f":"'Workload Data Entry'!C89","v":0}]
[null,null,null,null,null,null,"Workload-Individual-TotalTests-Q1-1-62","Total Tests - Plasma/Serum/Blood - Cholesterol",{"$f":"'Workload Data Entry'!C90","v":0}]
[null,null,null,null,null,null,"Workload-Individual-TotalTests-Q1-1-63","Total Tests - Plasma/Serum/Blood - Cholinesterase",{"$f":"'Workload Data Entry'!C91","v":0}]
[null,null,null,null,null,null,"Workload-Individual-TotalTests-Q1-1-64","Total Tests - Plasma/Serum/Blood - Cholinesterase phenotype (count as 1 test)",{"$f":"'Workload Data Entry'!C92","v":0}]
[null,null,null,null,null,null,"Workload-Individual-TotalTests-Q1-1-65","Total Tests - Plasma/Serum/Blood - Chromium",{"$f":"'Workload Data Entry'!C93","v":0}]
[null,null,null,null,null,null,"Workload-Individual-TotalTests-Q1-1-66","Total Tests - Plasma/Serum/Blood - CK (Creatine Kinase)",{"$f":"'Workload Data Entry'!C94","v":0}]
[null,null,null,null,null,null,"Workload-Individual-TotalTests-Q1-1-67","Total Tests - Plasma/Serum/Blood - CKMB Enzymatic",{"$f":"'Workload Data Entry'!C95","v":0}]
[null,null,null,null,null,null,"Workload-Individual-TotalTests-Q1-1-68","Total Tests - Plasma/Serum/Blood - CKMB Mass",{"$f":"'Workload Data Entry'!C96","v":0}]
[null,null,null,null,null,null,"Workload-Individual-TotalTests-Q1-1-69","Total Tests - Plasma/Serum/Blood - Cobalt",{"$f":"'Workload Data Entry'!C97","v":0}]
[null,null,null,null,null,null,"Workload-Individual-TotalTests-Q1-1-70","Total Tests - Plasma/Serum/Blood - Copper",{"$f":"'Workload Data Entry'!C98","v":0}]
[null,null,null,null,null,null,"Workload-Individual-TotalTests-Q1-1-71","Total Tests - Plasma/Serum/Blood - Cortisol",{"$f":"'Workload Data Entry'!C99","v":0}]
[null,null,null,null,null,null,"Workload-Individual-TotalTests-Q1-1-72","Total Tests - Plasma/Serum/Blood - C-Reactive Protein",{"$f":"'Workload Data Entry'!C100","v":0}]
[null,null,null,null,null,null,"Workload-Individual-TotalTests-Q1-1-73","Total Tests - Plasma/Serum/Blood - Creatinine Enzymatic",{"$f":"'Workload Data Entry'!C101","v":0}]
[null,null,null,null,null,null,"Workload-Individual-TotalTests-Q1-1-74","Total Tests - Plasma/Serum/Blood - Creatinine JAFFE",{"$f":"'Workload Data Entry'!C102","v":0}]
[null,null,null,null,null,null,"Workload-Individual-TotalTests-Q1-1-75","Total Tests - Plasma/Serum/Blood - CTx",{"$f":"'Workload Data Entry'!C103","v":0}]
[null,null,null,null,null,null,"Workload-Individual-TotalTests-Q1-1-76","Total Tests - Plasma/Serum/Blood - Cyclic AMP",{"$f":"'Workload Data Entry'!C104","v":0}]
[null,null,null,null,null,null,"Workload-Individual-TotalTests-Q1-1-77","Total Tests - Plasma/Serum/Blood - Cyclosporin",{"$f":"'Workload Data Entry'!C105","v":0}]
[null,null,null,null,null,null,"Workload-Individual-TotalTests-Q1-1-78","Total Tests - Plasma/Serum/Blood - Cystatin",{"$f":"'Workload Data Entry'!C106","v":0}]
[null,null,null,null,null,null,"Workload-Individual-TotalTests-Q1-1-79","Total Tests - Plasma/Serum/Blood - DHAS/DHEAS",{"$f":"'Workload Data Entry'!C107","v":0}]
[null,null,null,null,null,null,"Workload-Individual-TotalTests-Q1-1-80","Total Tests - Plasma/Serum/Blood - Digoxin",{"$f":"'Workload Data Entry'!C108","v":0}]
[null,null,null,null,null,null,"Workload-Individual-TotalTests-Q1-1-81","Total Tests - Plasma/Serum/Blood - Dihydrotestosterone",{"$f":"'Workload Data Entry'!C109","v":0}]
[null,null,null,null,null,null,"Workload-Individual-TotalTests-Q1-1-82","Total Tests - Plasma/Serum/Blood - Dopamine",{"$f":"'Workload Data Entry'!C110","v":0}]
[null,null,null,null,null,null,"Workload-Individual-TotalTests-Q1-1-83","Total Tests - Plasma/Serum/Blood - Downs Screening",{"$f":"'Workload Data Entry'!C111","v":0}]
[null,null,null,null,null,null,"Workload-Individual-TotalTests-Q1-1-84","Total Tests - Plasma/Serum/Blood - Ethosuximide",{"$f":"'Workload Data Entry'!C112","v":0}]
[null,null,null,null,null,null,"Workload-Individual-TotalTests-Q1-1-85","Total Tests - Plasma/Serum/Blood - Ethylene Glycol",{"$f":"'Workload Data Entry'!C113","v":0}]
[null,null,null,null,null,null,"Workload-Individual-TotalTests-Q1-1-86","Total Tests - Plasma/Serum/Blood - Ferritin",{"$f":"'Workload Data Entry'!C114","v":0}]
[null,null,null,null,null,null,"Workload-Individual-TotalTests-Q1-1-87","Total Tests - Plasma/Serum/Blood - Flecainide",{"$f":"'Workload Data Entry'!C115","v":0}]
[null,null,null,null,null,null,"Workload-Individual-TotalTests-Q1-1-88","Total Tests - Plasma/Serum/Blood - Folate",{"$f":"'Workload Data Entry'!C116","v":0}]
[null,null,null,null,null,null,"Workload-Individual-TotalTests-Q1-1-89","Total Tests - Plasma/Serum/Blood - Folate (Red Cell)",{"$f":"'Workload Data Entry'!C117","v":0}]
[null,null,null,null,null,null,"Workload-Individual-TotalTests-Q1-1-90","Total Tests - Plasma/Serum/Blood - Fructosamine",{"$f":"'Workload Data Entry'!C118","v":0}]
[null,null,null,null,null,null,"Workload-Individual-TotalTests-Q1-1-91","Total Tests - Plasma/Serum/Blood - FSH",{"$f":"'Workload Data Entry'!C119","v":0}]
[null,null,null,null,null,null,"Workload-Individual-TotalTests-Q1-1-92","Total Tests - Plasma/Serum/Blood - Gamma Glutamyl Transferase",{"$f":"'Workload Data Entry'!C120","v":0}]
[null,null,null,null,null,null,"Workload-Individual-TotalTests-Q1-1-93","Total Tests - Plasma/Serum/Blood - Gastrin",{"$f":"'Workload Data Entry'!C121","v":0}]
[null,null,null,null,null,null,"Workload-Individual-TotalTests-Q1-1-94","Total Tests - Plasma/Serum/Blood - Glucagon",{"$f":"'Workload Data Entry'!C122","v":0}]
[null,null,null,null,null,null,"Workload-Individual-TotalTests-Q1-1-95","Total Tests - Plasma/Serum/Blood - Glucose",{"$f":"'Workload Data Entry'!C123","v":0}]
[null,null,null,null,null,null,"Workload-Individual-TotalTests-Q1-1-96","Total Tests - Plasma/Serum/Blood - Growth Hormone",{"$f":"'Workload Data Entry'!C124","v":0}]
[null,null,null,null,null,null,"Workload-Individual-TotalTests-Q1-1-97","Total Tests - Plasma/Serum/Blood - Gut hormone screen",{"$f":"'Workload Data Entry'!C125","v":0}]
[null,null,null,null,null,null,"Workload-Individual-TotalTests-Q1-1-98","Total Tests - Plasma/Serum/Blood - Haptoglobin",{"$f":"'Workload Data Entry'!C126","v":0}]
[null,null,null,null,null,null,"Workload-Individual-TotalTests-Q1-1-99","Total Tests - Plasma/Serum/Blood - HbA1c",{"$f":"'Workload Data Entry'!C127","v":0}]
[null,null,null,null,null,null,"Workload-Individual-TotalTests-Q1-1-100","Total Tests - Plasma/Serum/Blood - HCG (Non-Downs)",{"$f":"'Workload Data Entry'!C128","v":0}]
[null,null,null,null,null,null,"Workload-Individual-TotalTests-Q1-1-101","Total Tests - Plasma/Serum/Blood - HDL",{"$f":"'Workload Data Entry'!C129","v":0}]
[null,null,null,null,null,null,"Workload-Individual-TotalTests-Q1-1-102","Total Tests - Plasma/Serum/Blood - HFE Genotype (Haemochromatosis)",{"$f":"'Workload Data Entry'!C130","v":0}]
[null,null,null,null,null,null,"Workload-Individual-TotalTests-Q1-1-103","Total Tests - Plasma/Serum/Blood - Homocysteine",{"$f":"'Workload Data Entry'!C131","v":0}]
[null,null,null,null,null,null,"Workload-Individual-TotalTests-Q1-1-104","Total Tests - Plasma/Serum/Blood - IGF1",{"$f":"'Workload Data Entry'!C132","v":0}]
[null,null,null,null,null,null,"Workload-Individual-TotalTests-Q1-1-105","Total Tests - Plasma/Serum/Blood - IGFBP-3",{"$f":"'Workload Data Entry'!C133","v":0}]
[null,null,null,null,null,null,"Workload-Individual-TotalTests-Q1-1-106","Total Tests - Plasma/Serum/Blood - Inhibin A/B",{"$f":"'Workload Data Entry'!C134","v":0}]
[null,null,null,null,null,null,"Workload-Individual-TotalTests-Q1-1-107","Total Tests - Plasma/Serum/Blood - Insulin",{"$f":"'Workload Data Entry'!C135","v":0}]
[null,null,null,null,null,null,"Workload-Individual-TotalTests-Q1-1-108","Total Tests - Plasma/Serum/Blood - Insulin C-Peptide",{"$f":"'Workload Data Entry'!C136","v":0}]
[null,null,null,null,null,null,"Workload-Individual-TotalTests-Q1-1-109","Total Tests - Plasma/Serum/Blood - Iron",{"$f":"'Workload Data Entry'!C137","v":0}]
[null,null,null,null,null,null,"Workload-Individual-TotalTests-Q1-1-110","Total Tests - Plasma/Serum/Blood - Iron Binding Capacity",{"$f":"'Workload Data Entry'!C138","v":0}]
[null,null,null,null,null,null,"Workload-Individual-TotalTests-Q1-1-111","Total Tests - Plasma/Serum/Blood - Lactate",{"$f":"'Workload Data Entry'!C139","v":0}]
[null,null,null,null,null,null,"Workload-Individual-TotalTests-Q1-1-112","Total Tests - Plasma/Serum/Blood - Lamotrigine",{"$f":"'Workload Data Entry'!C140","v":0}]
[null,null,null,null,null,null,"Workload-Individual-TotalTests-Q1-1-113","Total Tests - Plasma/Serum/Blood - LDH",{"$f":"'Workload Data Entry'!C141","v":0}]
[null,null,null,null,null,null,"Workload-Individual-TotalTests-Q1-1-114","Total Tests - Plasma/Serum/Blood - LDL (Direct)",{"$f":"'Workload Data Entry'!C142","v":0}]
[null,null,null,null,null,null,"Workload-Individual-TotalTests-Q1-1-115","Total Tests - Plasma/Serum/Blood - Lead",{"$f":"'Workload Data Entry'!C143","v":0}]
[null,null,null,null,null,null,"Workload-Individual-TotalTests-Q1-1-116","Total Tests - Plasma/Serum/Blood - Leptin",{"$f":"'Workload Data Entry'!C144","v":0}]
[null,null,null,null,null,null,"Workload-Individual-TotalTests-Q1-1-117","Total Tests - Plasma/Serum/Blood - LH",{"$f":"'Workload Data Entry'!C145","v":0}]
[null,null,null,null,null,null,"Workload-Individual-TotalTests-Q1-1-118","Total Tests - Plasma/Serum/Blood - Lipoprotein Lipase",{"$f":"'Workload Data Entry'!C146","v":0}]
[null,null,null,null,null,null,"Workload-Individual-TotalTests-Q1-1-119","Total Tests - Plasma/Serum/Blood - Lithium",{"$f":"'Workload Data Entry'!C147","v":0}]
[null,null,null,null,null,null,"Workload-Individual-TotalTests-Q1-1-120","Total Tests - Plasma/Serum/Blood - Lp(a)",{"$f":"'Workload Data Entry'!C148","v":0}]
[null,null,null,null,null,null,"Workload-Individual-TotalTests-Q1-1-121","Total Tests - Plasma/Serum/Blood - Macroprolactin",{"$f":"'Workload Data Entry'!C149","v":0}]
[null,null,null,null,null,null,"Workload-Individual-TotalTests-Q1-1-122","Total Tests - Plasma/Serum/Blood - Magnesium",{"$f":"'Workload Data Entry'!C150","v":0}]
[null,null,null,null,null,null,"Workload-Individual-TotalTests-Q1-1-123","Total Tests - Plasma/Serum/Blood - Manganese",{"$f":"'Workload Data Entry'!C151","v":0}]
[null,null,null,null,null,null,"Workload-Individual-TotalTests-Q1-1-124","Total Tests - Plasma/Serum/Blood - Mercury",{"$f":"'Workload Data Entry'!C152","v":0}]
[null,null,null,null,null,null,"Workload-Individual-TotalTests-Q1-1-125","Total Tests - Plasma/Serum/Blood - Methaemoglobin",{"$f":"'Workload Data Entry'!C153","v":0}]
[null,null,null,null,null,null,"Workload-Individual-TotalTests-Q1-1-126","Total Tests - Plasma/Serum/Blood - Methanol",{"$f":"'Workload Data Entry'!C154","v":0}]
[null,null,null,null,null,null,"Workload-Individual-TotalTests-Q1-1-127","Total Tests - Plasma/Serum/Blood - Methotrexate",{"$f":"'Workload Data Entry'!C155","v":0}]
[null,null,null,null,null,null,"Workload-Individual-TotalTests-Q1-1-128","Total Tests - Plasma/Serum/Blood - Myoglobin",{"$f":"'Workload Data Entry'!C156","v":0}]
[null,null,null,null,null,null,"Workload-Individual-TotalTests-Q1-1-129","Total Tests - Plasma/Serum/Blood - Neurone Specific Enolase",{"$f":"'Workload Data Entry'!C157","v":0}]
[null,null,null,null,null,null,"Workload-Individual-TotalTests-Q1-1-130","Total Tests - Plasma/Serum/Blood - Noradrenaline",{"$f":"'Workload Data Entry'!C158","v":0}]
[null,null,null,null,null,null,"Workload-Individual-TotalTests-Q1-1-131","Total Tests - Plasma/Serum/Blood - Nortripyline",{"$f":"'Workload Data Entry'!C159","v":0}]
[null,null,null,null,null,null,"Workload-Individual-TotalTests-Q1-1-132","Total Tests - Plasma/Serum/Blood - Oestradiol",{"$f":"'Workload Data Entry'!C160","v":0}]
[null,null,null,null,null,null,"Workload-Individual-TotalTests-Q1-1-133","Total Tests - Plasma/Serum/Blood - Orosomucoid",{"$f":"'Workload Data Entry'!C161","v":0}]
[null,null,null,null,null,null,"Workload-Individual-TotalTests-Q1-1-134","Total Tests - Plasma/Serum/Blood - Osmolality",{"$f":"'Workload Data Entry'!C162","v":0}]
[null,null,null,null,null,null,"Workload-Individual-TotalTests-Q1-1-135","Total Tests - Plasma/Serum/Blood - Osteocalcein",{"$f":"'Workload Data Entry'!C163","v":0}]
[null,null,null,null,null,null,"Workload-Individual-TotalTests-Q1-1-136","Total Tests - Plasma/Serum/Blood - ELF Testing",{"$f":"'Workload Data Entry'!C164","v":0}]
[null,null,null,null,null,null,"Workload-Individual-TotalTests-Q1-1-137","Total Tests - Plasma/Serum/Blood - P111NP (Only those not already included in ELF testing)",{"$f":"'Workload Data Entry'!C165","v":0}]
[null,null,null,null,null,null,"Workload-Individual-TotalTests-Q1-1-138","Total Tests - Plasma/Serum/Blood - P1CP (bone markers)",{"$f":"'Workload Data Entry'!C166","v":0}]
[null,null,null,null,null,null,"Workload-Individual-TotalTests-Q1-1-139","Total Tests - Plasma/Serum/Blood - P1NP (bone markers)",{"$f":"'Workload Data Entry'!C167","v":0}]
[null,null,null,null,null,null,"Workload-Individual-TotalTests-Q1-1-140","Total Tests - Plasma/Serum/Blood - Pancreatic Polypeptide",{"$f":"'Workload Data Entry'!C168","v":0}]
[null,null,null,null,null,null,"Workload-Individual-TotalTests-Q1-1-141","Total Tests - Plasma/Serum/Blood - Paracetamol",{"$f":"'Workload Data Entry'!C169","v":0}]
[null,null,null,null,null,null,"Workload-Individual-TotalTests-Q1-1-142","Total Tests - Plasma/Serum/Blood - Phenobarbitone",{"$f":"'Workload Data Entry'!C170","v":0}]
[null,null,null,null,null,null,"Workload-Individual-TotalTests-Q1-1-143","Total Tests - Plasma/Serum/Blood - Phenytoin",{"$f":"'Workload Data Entry'!C171","v":0}]
[null,null,null,null,null,null,"Workload-Individual-TotalTests-Q1-1-144","Total Tests - Plasma/Serum/Blood - Phosphate",{"$f":"'Workload Data Entry'!C172","v":0}]
[null,null,null,null,null,null,"Workload-Individual-TotalTests-Q1-1-145","Total Tests - Plasma/Serum/Blood - PKU for Neonatal Screening",{"$f":"'Workload Data Entry'!C173","v":0}]
[null,null,null,null,null,null,"Workload-Individual-TotalTests-Q1-1-146","Total Tests - Plasma/Serum/Blood - Placental Alkaline Phosphatase",{"$f":"'Workload Data Entry'!C174","v":0}]
[null,null,null,null,null,null,"Workload-Individual-TotalTests-Q1-1-147","Total Tests - Plasma/Serum/Blood - Porphyrins",{"$f":"'Workload Data Entry'!C175","v":0}]
[null,null,null,null,null,null,"Workload-Individual-TotalTests-Q1-1-148","Total Tests - Plasma/Serum/Blood - Potassium",{"$f":"'Workload Data Entry'!C176","v":0}]
[null,null,null,null,null,null,"Workload-Individual-TotalTests-Q1-1-149","Total Tests - Plasma/Serum/Blood - Procalcitonin",{"$f":"'Workload Data Entry'!C177","v":0}]
[null,null,null,null,null,null,"Workload-Individual-TotalTests-Q1-1-150","Total Tests - Plasma/Serum/Blood - Progesterone",{"$f":"'Workload Data Entry'!C178","v":0}]
[null,null,null,null,null,null,"Workload-Individual-TotalTests-Q1-1-151","Total Tests - Plasma/Serum/Blood - Proinsulin",{"$f":"'Workload Data Entry'!C179","v":0}]
[null,null,null,null,null,null,"Workload-Individual-TotalTests-Q1-1-152","Total Tests - Plasma/Serum/Blood - Prolactin",{"$f":"'Workload Data Entry'!C180","v":0}]
[null,null,null,null,null,null,"Workload-Individual-TotalTests-Q1-1-153","Total Tests - Plasma/Serum/Blood - Protein S100",{"$f":"'Workload Data Entry'!C181","v":0}]
[null,null,null,null,null,null,"Workload-Individual-TotalTests-Q1-1-154","Total Tests - Plasma/Serum/Blood - PSA (Free)",{"$f":"'Workload Data Entry'!C182","v":0}]
[null,null,null,null,null,null,"Workload-Individual-TotalTests-Q1-1-155","Total Tests - Plasma/Serum/Blood - PSA (Total)",{"$f":"'Workload Data Entry'!C183","v":0}]
[null,null,null,null,null,null,"Workload-Individual-TotalTests-Q1-1-156","Total Tests - Plasma/Serum/Blood - PTH",{"$f":"'Workload Data Entry'!C184","v":0}]
[null,null,null,null,null,null,"Workload-Individual-TotalTests-Q1-1-157","Total Tests - Plasma/Serum/Blood - PTHrP",{"$f":"'Workload Data Entry'!C185","v":0}]
[null,null,null,null,null,null,"Workload-Individual-TotalTests-Q1-1-158","Total Tests - Plasma/Serum/Blood - Pyruvate",{"$f":"'Workload Data Entry'!C186","v":0}]
[null,null,null,null,null,null,"Workload-Individual-TotalTests-Q1-1-159","Total Tests - Plasma/Serum/Blood - Quantitative thyroid hormone binding",{"$f":"'Workload Data Entry'!C187","v":0}]
[null,null,null,null,null,null,"Workload-Individual-TotalTests-Q1-1-160","Total Tests - Plasma/Serum/Blood - Renin Activity",{"$f":"'Workload Data Entry'!C188","v":0}]
[null,null,null,null,null,null,"Workload-Individual-TotalTests-Q1-1-161","Total Tests - Plasma/Serum/Blood - Salicylate",{"$f":"'Workload Data Entry'!C189","v":0}]
[null,null,null,null,null,null,"Workload-Individual-TotalTests-Q1-1-162","Total Tests - Plasma/Serum/Blood - Selenium",{"$f":"'Workload Data Entry'!C190","v":0}]
[null,null,null,null,null,null,"Workload-Individual-TotalTests-Q1-1-163","Total Tests - Plasma/Serum/Blood - SHBG",{"$f":"'Workload Data Entry'!C191","v":0}]
[null,null,null,null,null,null,"Workload-Individual-TotalTests-Q1-1-164","Total Tests - Plasma/Serum/Blood - Sirolimus",{"$f":"'Workload Data Entry'!C192","v":0}]
[null,null,null,null,null,null,"Workload-Individual-TotalTests-Q1-1-165","Total Tests - Plasma/Serum/Blood - Sodium",{"$f":"'Workload Data Entry'!C193","v":0}]
[null,null,null,null,null,null,"Workload-Individual-TotalTests-Q1-1-166","Total Tests - Plasma/Serum/Blood - Somatostatin",{"$f":"'Workload Data Entry'!C194","v":0}]
[null,null,null,null,null,null,"Workload-Individual-TotalTests-Q1-1-167","Total Tests - Plasma/Serum/Blood - Sulphonylureas",{"$f":"'Workload Data Entry'!C195","v":0}]
[null,null,null,null,null,null,"Workload-Individual-TotalTests-Q1-1-168","Total Tests - Plasma/Serum/Blood - T3 (free)",{"$f":"'Workload Data Entry'!C196","v":0}]
[null,null,null,null,null,null,"Workload-Individual-TotalTests-Q1-1-169","Total Tests - Plasma/Serum/Blood - T3 (Total)",{"$f":"'Workload Data Entry'!C197","v":0}]
[null,null,null,null,null,null,"Workload-Individual-TotalTests-Q1-1-170","Total Tests - Plasma/Serum/Blood - T4 (Free)",{"$f":"'Workload Data Entry'!C198","v":0}]
[null,null,null,null,null,null,"Workload-Individual-TotalTests-Q1-1-171","Total Tests - Plasma/Serum/Blood - T4 (Total)",{"$f":"'Workload Data Entry'!C199","v":0}]
[null,null,null,null,null,null,"Workload-Individual-TotalTests-Q1-1-172","Total Tests - Plasma/Serum/Blood - Tacrolimus (FK 506)",{"$f":"'Workload Data Entry'!C200","v":0}]
[null,null,null,null,null,null,"Workload-Individual-TotalTests-Q1-1-173","Total Tests - Plasma/Serum/Blood - Testosterone",{"$f":"'Workload Data Entry'!C201","v":0}]
[null,null,null,null,null,null,"Workload-Individual-TotalTests-Q1-1-174","Total Tests - Plasma/Serum/Blood - Theophyline",{"$f":"'Workload Data Entry'!C202","v":0}]
[null,null,null,null,null,null,"Workload-Individual-TotalTests-Q1-1-175","Total Tests - Plasma/Serum/Blood - Thiamine Diphosphate",{"$f":"'Workload Data Entry'!C203","v":0}]
[null,null,null,null,null,null,"Workload-Individual-TotalTests-Q1-1-176","Total Tests - Plasma/Serum/Blood - Thyroglobulin",{"$f":"'Workload Data Entry'!C204","v":0}]
[null,null,null,null,null,null,"Workload-Individual-TotalTests-Q1-1-177","Total Tests - Plasma/Serum/Blood - Thyroid Binding Globulin",{"$f":"'Workload Data Entry'!C205","v":0}]
[null,null,null,null,null,null,"Workload-Individual-TotalTests-Q1-1-178","Total Tests - Plasma/Serum/Blood - Total Protein",{"$f":"'Workload Data Entry'!C206","v":0}]
[null,null,null,null,null,null,"Workload-Individual-TotalTests-Q1-1-179","Total Tests - Plasma/Serum/Blood - TPMT",{"$f":"'Workload Data Entry'!C207","v":0}]
[null,null,null,null,null,null,"Workload-Individual-TotalTests-Q1-1-180","Total Tests - Plasma/Serum/Blood - Transferrin",{"$f":"'Workload Data Entry'!C208","v":0}]
[null,null,null,null,null,null,"Workload-Individual-TotalTests-Q1-1-181","Total Tests - Plasma/Serum/Blood - Transketolase",{"$f":"'Workload Data Entry'!C209","v":0}]
[null,null,null,null,null,null,"Workload-Individual-TotalTests-Q1-1-182","Total Tests - Plasma/Serum/Blood - Triglyceride",{"$f":"'Workload Data Entry'!C210","v":0}]
[null,null,null,null,null,null,"Workload-Individual-TotalTests-Q1-1-183","Total Tests - Plasma/Serum/Blood - Troponin I",{"$f":"'Workload Data Entry'!C211","v":0}]
[null,null,null,null,null,null,"Workload-Individual-TotalTests-Q1-1-184","Total Tests - Plasma/Serum/Blood - Troponin T",{"$f":"'Workload Data Entry'!C212","v":0}]
[null,null,null,null,null,null,"Workload-Individual-TotalTests-Q1-1-185","Total Tests - Plasma/Serum/Blood - TSH (Routine)",{"$f":"'Workload Data Entry'!C213","v":0}]
[null,null,null,null,null,null,"Workload-Individual-TotalTests-Q1-1-186","Total Tests - Plasma/Serum/Blood - TSH Receptor AB",{"$f":"'Workload Data Entry'!C214","v":0}]
[null,null,null,null,null,null,"Workload-Individual-TotalTests-Q1-1-187","Total Tests - Plasma/Serum/Blood - Urea",{"$f":"'Workload Data Entry'!C215","v":0}]
[null,null,null,null,null,null,"Workload-Individual-TotalTests-Q1-1-188","Total Tests - Plasma/Serum/Blood - Uric Acid",{"$f":"'Workload Data Entry'!C216","v":0}]
[null,null,null,null,null,null,"Workload-Individual-TotalTests-Q1-1-189","Total Tests - Plasma/Serum/Blood - Valproate",{"$f":"'Workload Data Entry'!C217","v":0}]
[null,null,null,null,null,null,"Workload-Individual-TotalTests-Q1-1-190","Total Tests - Plasma/Serum/Blood - Vasoactive Intestinal Polypeptide",{"$f":"'Workload Data Entry'!C218","v":0}]
[null,null,null,null,null,null,"Workload-Individual-TotalTests-Q1-1-191","Total Tests - Plasma/Serum/Blood - Vitamin A",{"$f":"'Workload Data Entry'!C219","v":0}]
[null,null,null,null,null,null,"Workload-Individual-TotalTests-Q1-1-192","Total Tests - Plasma/Serum/Blood - Vitamin B6",{"$f":"'Workload Data Entry'!C220","v":0}]
[null,null,null,null,null,null,"Workload-Individual-TotalTests-Q1-1-193","Total Tests - Plasma/Serum/Blood - Vitamin C",{"$f":"'Workload Data Entry'!C221","v":0}]
[null,null,null,null,null,null,"Workload-Individual-TotalTests-Q1-1-194","Total Tests - Plasma/Serum/Blood - Vitamin E",{"$f":"'Workload Data Entry'!C222","v":0}]
[null,null,null,null,null,null,"Workload-Individual-TotalTests-Q1-1-195","Total Tests - Plasma/Serum/Blood - White cell enzymes",{"$f":"'Workload Data Entry'!C223","v":0}]
[null,null,null,null,null,null,"Workload-Individual-TotalTests-Q1-1-196","Total Tests - Plasma/Serum/Blood - Zinc",{"$f":"'Workload Data Entry'!C224","v":0}]
[null,null,null,null,null,null,"Workload-Individual-TotalTests-Q1-1-197","Total Tests - Plasma/Serum/Blood - Total Plasma/Serum/Blood Tests",{"$f":"'Workload Data Entry'!C225","v":0}]
[null,null,null,null,null,null,"Workload-Individual-TotalTests-Q1-2-1","Total Tests - Urine Drugs of Abuse - Amphetamine",{"$f":"'Workload Data Entry'!C228","v":0}]
[null,null,null,null,null,null,"Workload-Individual-TotalTests-Q1-2-2","Total Tests - Urine Drugs of Abuse - Barbiturates",{"$f":"'Workload Data Entry'!C229","v":0}]
[null,null,null,null,null,null,"Workload-Individual-TotalTests-Q1-2-3","Total Tests - Urine Drugs of Abuse - Benzodiazepine",{"$f":"'Workload Data Entry'!C230","v":0}]
[null,null,null,null,null,null,"Workload-Individual-TotalTests-Q1-2-4","Total Tests - Urine Drugs of Abuse - Buprenorphine",{"$f":"'Workload Data Entry'!C231","v":0}]
[null,null,null,null,null,null,"Workload-Individual-TotalTests-Q1-2-5","Total Tests - Urine Drugs of Abuse - Cannabis",{"$f":"'Workload Data Entry'!C232","v":0}]
[null,null,null,null,null,null,"Workload-Individual-TotalTests-Q1-2-6","Total Tests - Urine Drugs of Abuse - Cocaine",{"$f":"'Workload Data Entry'!C233","v":0}]
[null,null,null,null,null,null,"Workload-Individual-TotalTests-Q1-2-7","Total Tests - Urine Drugs of Abuse - GC/MS Confirmation",{"$f":"'Workload Data Entry'!C234","v":0}]
[null,null,null,null,null,null,"Workload-Individual-TotalTests-Q1-2-8","Total Tests - Urine Drugs of Abuse - LSD",{"$f":"'Workload Data Entry'!C235","v":0}]
[null,null,null,null,null,null,"Workload-Individual-TotalTests-Q1-2-9","Total Tests - Urine Drugs of Abuse - Methadone",{"$f":"'Workload Data Entry'!C236","v":0}]
[null,null,null,null,null,null,"Workload-Individual-TotalTests-Q1-2-10","Total Tests - Urine Drugs of Abuse - Opiates",{"$f":"'Workload Data Entry'!C237","v":0}]
[null,null,null,null,null,null,"Workload-Individual-TotalTests-Q1-2-11","Total Tests - Urine Drugs of Abuse - Rapid Slide test (e.g. Triage, InstAlert etc)",{"$f":"'Workload Data Entry'!C238","v":0}]
[null,null,null,null,null,null,"Workload-Individual-TotalTests-Q1-2-12","Total Tests - Urine Drugs of Abuse - TLC confirmation",{"$f":"'Workload Data Entry'!C239","v":0}]
[null,null,null,null,null,null,"Workload-Individual-TotalTests-Q1-2-13","Total Tests - Urine Drugs of Abuse - Total Urine Drugs of Abuse",{"$f":"'Workload Data Entry'!C240","v":0}]
[null,null,null,null,null,null,"Workload-Individual-TotalTests-Q1-3-1","Total Tests - Other Urine Tests - 5 Hydroxy Indole Acetic Acid",{"$f":"'Workload Data Entry'!C243","v":0}]
[null,null,null,null,null,null,"Workload-Individual-TotalTests-Q1-3-2","Total Tests - Other Urine Tests - Albumin/Microalbumin (urine)",{"$f":"'Workload Data Entry'!C244","v":0}]
[null,null,null,null,null,null,"Workload-Individual-TotalTests-Q1-3-3","Total Tests - Other Urine Tests - Alcohol",{"$f":"'Workload Data Entry'!C245","v":0}]
[null,null,null,null,null,null,"Workload-Individual-TotalTests-Q1-3-4","Total Tests - Other Urine Tests - Amino acid profiles (x1)",{"$f":"'Workload Data Entry'!C246","v":0}]
[null,null,null,null,null,null,"Workload-Individual-TotalTests-Q1-3-5","Total Tests - Other Urine Tests - Amylase",{"$f":"'Workload Data Entry'!C247","v":0}]
[null,null,null,null,null,null,"Workload-Individual-TotalTests-Q1-3-6","Total Tests - Other Urine Tests - B2 Microglobulin",{"$f":"'Workload Data Entry'!C248","v":0}]
[null,null,null,null,null,null,"Workload-Individual-TotalTests-Q1-3-7","Total Tests - Other Urine Tests - Bilirbubin",{"$f":"'Workload Data Entry'!C249","v":0}]
[null,null,null,null,null,null,"Workload-Individual-TotalTests-Q1-3-8","Total Tests - Other Urine Tests - Calcium",{"$f":"'Workload Data Entry'!C250","v":0}]
[null,null,null,null,null,null,"Workload-Individual-TotalTests-Q1-3-9","Total Tests - Other Urine Tests - Catecholamines (including metadrenaline), HPLC (count as 1 test)",{"$f":"'Workload Data Entry'!C251","v":0}]
[null,null,null,null,null,null,"Workload-Individual-TotalTests-Q1-3-10","Total Tests - Other Urine Tests - Chloride",{"$f":"'Workload Data Entry'!C252","v":0}]
[null,null,null,null,null,null,"Workload-Individual-TotalTests-Q1-3-11","Total Tests - Other Urine Tests - Copper",{"$f":"'Workload Data Entry'!C253","v":0}]
[null,null,null,null,null,null,"Workload-Individual-TotalTests-Q1-3-12","Total Tests - Other Urine Tests - Cortisol (UFC)",{"$f":"'Workload Data Entry'!C254","v":0}]
[null,null,null,null,null,null,"Workload-Individual-TotalTests-Q1-3-13","Total Tests - Other Urine Tests - Cotinine",{"$f":"'Workload Data Entry'!C255","v":0}]
[null,null,null,null,null,null,"Workload-Individual-TotalTests-Q1-3-14","Total Tests - Other Urine Tests - Creatinine",{"$f":"'Workload Data Entry'!C256","v":0}]
[null,null,null,null,null,null,"Workload-Individual-TotalTests-Q1-3-15","Total Tests - Other Urine Tests - Cystine",{"$f":"'Workload Data Entry'!C257","v":0}]
[null,null,null,null,null,null,"Workload-Individual-TotalTests-Q1-3-16","Total Tests - Other Urine Tests - DPD",{"$f":"'Workload Data Entry'!C258","v":0}]
[null,null,null,null,null,null,"Workload-Individual-TotalTests-Q1-3-17","Total Tests - Other Urine Tests - Glucose",{"$f":"'Workload Data Entry'!C259","v":0}]
[null,null,null,null,null,null,"Workload-Individual-TotalTests-Q1-3-18","Total Tests - Other Urine Tests - Iron",{"$f":"'Workload Data Entry'!C260","v":0}]
[null,null,null,null,null,null,"Workload-Individual-TotalTests-Q1-3-19","Total Tests - Other Urine Tests - Laxative screen",{"$f":"'Workload Data Entry'!C261","v":0}]
[null,null,null,null,null,null,"Workload-Individual-TotalTests-Q1-3-20","Total Tests - Other Urine Tests - Light Chains",{"$f":"'Workload Data Entry'!C262","v":0}]
[null,null,null,null,null,null,"Workload-Individual-TotalTests-Q1-3-21","Total Tests - Other Urine Tests - Magnesium",{"$f":"'Workload Data Entry'!C263","v":0}]
[null,null,null,null,null,null,"Workload-Individual-TotalTests-Q1-3-22","Total Tests - Other Urine Tests - Mercury",{"$f":"'Workload Data Entry'!C264","v":0}]
[null,null,null,null,null,null,"Workload-Individual-TotalTests-Q1-3-23","Total Tests - Other Urine Tests - Mucopolysaccharides",{"$f":"'Workload Data Entry'!C265","v":0}]
[null,null,null,null,null,null,"Workload-Individual-TotalTests-Q1-3-24","Total Tests - Other Urine Tests - Myoglobin",{"$f":"'Workload Data Entry'!C266","v":0}]
[null,null,null,null,null,null,"Workload-Individual-TotalTests-Q1-3-25","Total Tests - Other Urine Tests - NAG",{"$f":"'Workload Data Entry'!C267","v":0}]
[null,null,null,null,null,null,"Workload-Individual-TotalTests-Q1-3-26","Total Tests - Other Urine Tests - Nitrogen",{"$f":"'Workload Data Entry'!C268","v":0}]
[null,null,null,null,null,null,"Workload-Individual-TotalTests-Q1-3-27","Total Tests - Other Urine Tests - Normetadrenaline",{"$f":"'Workload Data Entry'!C269","v":0}]
[null,null,null,null,null,null,"Workload-Individual-TotalTests-Q1-3-28","Total Tests - Other Urine Tests - Organic acids",{"$f":"'Workload Data Entry'!C270","v":0}]
[null,null,null,null,null,null,"Workload-Individual-TotalTests-Q1-3-29","Total Tests - Other Urine Tests - Osmolality",{"$f":"'Workload Data Entry'!C271","v":0}]
[null,null,null,null,null,null,"Workload-Individual-TotalTests-Q1-3-30","Total Tests - Other Urine Tests - Oxalate",{"$f":"'Workload Data Entry'!C272","v":0}]
[null,null,null,null,null,null,"Workload-Individual-TotalTests-Q1-3-31","Total Tests - Other Urine Tests - Paraquat",{"$f":"'Workload Data Entry'!C273","v":0}]
[null,null,null,null,null,null,"Workload-Individual-TotalTests-Q1-3-32","Total Tests - Other Urine Tests - Phosphate",{"$f":"'Workload Data Entry'!C274","v":0}]
[null,null,null,null,null,null,"Workload-Individual-TotalTests-Q1-3-33","Total Tests - Other Urine Tests - Porphobilinogen",{"$f":"'Workload Data Entry'!C275","v":0}]
[null,null,null,null,null,null,"Workload-Individual-TotalTests-Q1-3-34","Total Tests - Other Urine Tests - Porphyrins",{"$f":"'Workload Data Entry'!C276","v":0}]
[null,null,null,null,null,null,"Workload-Individual-TotalTests-Q1-3-35","Total Tests - Other Urine Tests - Potassium",{"$f":"'Workload Data Entry'!C277","v":0}]
[null,null,null,null,null,null,"Workload-Individual-TotalTests-Q1-3-36","Total Tests - Other Urine Tests - Pregnancy Test (not by quantitation of HCG)",{"$f":"'Workload Data Entry'!C278","v":0}]
[null,null,null,null,null,null,"Workload-Individual-TotalTests-Q1-3-37","Total Tests - Other Urine Tests - Protein (24hr)",{"$f":"'Workload Data Entry'!C279","v":0}]
[null,null,null,null,null,null,"Workload-Individual-TotalTests-Q1-3-38","Total Tests - Other Urine Tests - Protein (reported as creatinine ratio)",{"$f":"'Workload Data Entry'!C280","v":0}]
[null,null,null,null,null,null,"Workload-Individual-TotalTests-Q1-3-39","Total Tests - Other Urine Tests - Reducing substances",{"$f":"'Workload Data Entry'!C281","v":0}]
[null,null,null,null,null,null,"Workload-Individual-TotalTests-Q1-3-40","Total Tests - Other Urine Tests - Sodium",{"$f":"'Workload Data Entry'!C282","v":0}]
[null,null,null,null,null,null,"Workload-Individual-TotalTests-Q1-3-41","Total Tests - Other Urine Tests - Steroid Profile (x1)",{"$f":"'Workload Data Entry'!C283","v":0}]
[null,null,null,null,null,null,"Workload-Individual-TotalTests-Q1-3-42","Total Tests - Other Urine Tests - Urate",{"$f":"'Workload Data Entry'!C284","v":0}]
[null,null,null,null,null,null,"Workload-Individual-TotalTests-Q1-3-43","Total Tests - Other Urine Tests - Urea",{"$f":"'Workload Data Entry'!C285","v":0}]
[null,null,null,null,null,null,"Workload-Individual-TotalTests-Q1-3-44","Total Tests - Other Urine Tests - Urine volume",{"$f":"'Workload Data Entry'!C286","v":0}]
[null,null,null,null,null,null,"Workload-Individual-TotalTests-Q1-3-45","Total Tests - Other Urine Tests - Urobilinogen",{"$f":"'Workload Data Entry'!C287","v":0}]
[null,null,null,null,null,null,"Workload-Individual-TotalTests-Q1-3-46","Total Tests - Other Urine Tests - Total Other Urine Tests",{"$f":"'Workload Data Entry'!C288","v":0}]
[null,null,null,null,null,null,"Workload-Individual-TotalTests-Q1-4-1","Total Tests - Fluids Tests - Albumin",{"$f":"'Workload Data Entry'!C291","v":0}]
[null,null,null,null,null,null,"Workload-Individual-TotalTests-Q1-4-2","Total Tests - Fluids Tests - Alpha-fetoprotein",{"$f":"'Workload Data Entry'!C292","v":0}]
[null,null,null,null,null,null,"Workload-Individual-TotalTests-Q1-4-3","Total Tests - Fluids Tests - Amylase",{"$f":"'Workload Data Entry'!C293","v":0}]
[null,null,null,null,null,null,"Workload-Individual-TotalTests-Q1-4-4","Total Tests - Fluids Tests - Creatinine",{"$f":"'Workload Data Entry'!C294","v":0}]
[null,null,null,null,null,null,"Workload-Individual-TotalTests-Q1-4-5","Total Tests - Fluids Tests - CSF Glucose",{"$f":"'Workload Data Entry'!C295","v":0}]
[null,null,null,null,null,null,"Workload-Individual-TotalTests-Q1-4-6","Total Tests - Fluids Tests - CSF IgG",{"$f":"'Workload Data Entry'!C296","v":0}]
[null,null,null,null,null,null,"Workload-Individual-TotalTests-Q1-4-7","Total Tests - Fluids Tests - CSF Protein",{"$f":"'Workload Data Entry'!C297","v":0}]
[null,null,null,null,null,null,"Workload-Individual-TotalTests-Q1-4-8","Total Tests - Fluids Tests - Glucose",{"$f":"'Workload Data Entry'!C298","v":0}]
[null,null,null,null,null,null,"Workload-Individual-TotalTests-Q1-4-9","Total Tests - Fluids Tests - HCG",{"$f":"'Workload Data Entry'!C299","v":0}]
[null,null,null,null,null,null,"Workload-Individual-TotalTests-Q1-4-10","Total Tests - Fluids Tests - Lactate Dehydrogenase",{"$f":"'Workload Data Entry'!C300","v":0}]
[null,null,null,null,null,null,"Workload-Individual-TotalTests-Q1-4-11","Total Tests - Fluids Tests - pH",{"$f":"'Workload Data Entry'!C301","v":0}]
[null,null,null,null,null,null,"Workload-Individual-TotalTests-Q1-4-12","Total Tests - Fluids Tests - Potassium",{"$f":"'Workload Data Entry'!C302","v":0}]
[null,null,null,null,null,null,"Workload-Individual-TotalTests-Q1-4-13","Total Tests - Fluids Tests - Protein",{"$f":"'Workload Data Entry'!C303","v":0}]
[null,null,null,null,null,null,"Workload-Individual-TotalTests-Q1-4-14","Total Tests - Fluids Tests - Sodium",{"$f":"'Workload Data Entry'!C304","v":0}]
[null,null,null,null,null,null,"Workload-Individual-TotalTests-Q1-4-15","Total Tests - Fluids Tests - Sweat Tests",{"$f":"'Workload Data Entry'!C305","v":0}]
[null,null,null,null,null,null,"Workload-Individual-TotalTests-Q1-4-16","Total Tests - Fluids Tests - Tau protein",{"$f":"'Workload Data Entry'!C306","v":0}]
[null,null,null,null,null,null,"Workload-Individual-TotalTests-Q1-4-17","Total Tests - Fluids Tests - Urate",{"$f":"'Workload Data Entry'!C307","v":0}]
[null,null,null,null,null,null,"Workload-Individual-TotalTests-Q1-4-18","Total Tests - Fluids Tests - Urea",{"$f":"'Workload Data Entry'!C308","v":0}]
[null,null,null,null,null,null,"Workload-Individual-TotalTests-Q1-4-19","Total Tests - Fluids Tests - Xanthochromia (spectrophotometric)",{"$f":"'Workload Data Entry'!C309","v":0}]
[null,null,null,null,null,null,"Workload-Individual-TotalTests-Q1-4-20","Total Tests - Fluids Tests - Total Fluids",{"$f":"'Workload Data Entry'!C310","v":0}]
[null,null,null,null,null,null,"Workload-Individual-TotalTests-Q1-5-1","Total Tests - Immunochemistry Tests - C1 Inhibitor antigenic assay",{"$f":"'Workload Data Entry'!C313","v":0}]
[null,null,null,null,null,null,"Workload-Individual-TotalTests-Q1-5-2","Total Tests - Immunochemistry Tests - C1 Inhibitor autoantibodies ",{"$f":"'Workload Data Entry'!C314","v":0}]
[null,null,null,null,null,null,"Workload-Individual-TotalTests-Q1-5-3","Total Tests - Immunochemistry Tests - C1 Inhibitor functional assay",{"$f":"'Workload Data Entry'!C315","v":0}]
[null,null,null,null,null,null,"Workload-Individual-TotalTests-Q1-5-4","Total Tests - Immunochemistry Tests - C1q autoantibody",{"$f":"'Workload Data Entry'!C316","v":0}]
[null,null,null,null,null,null,"Workload-Individual-TotalTests-Q1-5-5","Total Tests - Immunochemistry Tests - C3 quantitation",{"$f":"'Workload Data Entry'!C317","v":0}]
[null,null,null,null,null,null,"Workload-Individual-TotalTests-Q1-5-6","Total Tests - Immunochemistry Tests - C3d evaluations",{"$f":"'Workload Data Entry'!C318","v":0}]
[null,null,null,null,null,null,"Workload-Individual-TotalTests-Q1-5-7","Total Tests - Immunochemistry Tests - C4 quantitation",{"$f":"'Workload Data Entry'!C319","v":0}]
[null,null,null,null,null,null,"Workload-Individual-TotalTests-Q1-5-8","Total Tests - Immunochemistry Tests - CH50 or 100/AltCH50 or 100 ",{"$f":"'Workload Data Entry'!C320","v":0}]
[null,null,null,null,null,null,"Workload-Individual-TotalTests-Q1-5-9","Total Tests - Immunochemistry Tests - Complement activation e.g. for C3a C5a etc.",{"$f":"'Workload Data Entry'!C321","v":0}]
[null,null,null,null,null,null,"Workload-Individual-TotalTests-Q1-5-10","Total Tests - Immunochemistry Tests - Complement component e.g. C2, C8 etc",{"$f":"'Workload Data Entry'!C322","v":0}]
[null,null,null,null,null,null,"Workload-Individual-TotalTests-Q1-5-11","Total Tests - Immunochemistry Tests - Cryofibrinogen studies",{"$f":"'Workload Data Entry'!C323","v":0}]
[null,null,null,null,null,null,"Workload-Individual-TotalTests-Q1-5-12","Total Tests - Immunochemistry Tests - Cryoglobulin screen",{"$f":"'Workload Data Entry'!C324","v":0}]
[null,null,null,null,null,null,"Workload-Individual-TotalTests-Q1-5-13","Total Tests - Immunochemistry Tests - Cryoglobulin typing",{"$f":"'Workload Data Entry'!C325","v":0}]
[null,null,null,null,null,null,"Workload-Individual-TotalTests-Q1-5-14","Total Tests - Immunochemistry Tests - CSF Oligoclonal Bands",{"$f":"'Workload Data Entry'!C326","v":0}]
[null,null,null,null,null,null,"Workload-Individual-TotalTests-Q1-5-15","Total Tests - Immunochemistry Tests - Cytokine Levels",{"$f":"'Workload Data Entry'!C327","v":0}]
[null,null,null,null,null,null,"Workload-Individual-TotalTests-Q1-5-16","Total Tests - Immunochemistry Tests - IgA",{"$f":"'Workload Data Entry'!C328","v":0}]
[null,null,null,null,null,null,"Workload-Individual-TotalTests-Q1-5-17","Total Tests - Immunochemistry Tests - IgD",{"$f":"'Workload Data Entry'!C329","v":0}]
[null,null,null,null,null,null,"Workload-Individual-TotalTests-Q1-5-18","Total Tests - Immunochemistry Tests - IgG",{"$f":"'Workload Data Entry'!C330","v":0}]
[null,null,null,null,null,null,"Workload-Individual-TotalTests-Q1-5-19","Total Tests - Immunochemistry Tests - IgG subclasses (G1, 2, 3 and 4)",{"$f":"'Workload Data Entry'!C331","v":0}]
[null,null,null,null,null,null,"Workload-Individual-TotalTests-Q1-5-20","Total Tests - Immunochemistry Tests - IgM",{"$f":"'Workload Data Entry'!C332","v":0}]
[null,null,null,null,null,null,"Workload-Individual-TotalTests-Q1-5-21","Total Tests - Immunochemistry Tests - Mannose binding lectin",{"$f":"'Workload Data Entry'!C333","v":0}]
[null,null,null,null,null,null,"Workload-Individual-TotalTests-Q1-5-22","Total Tests - Immunochemistry Tests - Protein electrophoresis",{"$f":"'Workload Data Entry'!C334","v":0}]
[null,null,null,null,null,null,"Workload-Individual-TotalTests-Q1-5-23","Total Tests - Immunochemistry Tests - Serum free light chains",{"$f":"'Workload Data Entry'!C335","v":0}]
[null,null,null,null,null,null,"Workload-Individual-TotalTests-Q1-5-24","Total Tests - Immunochemistry Tests - Serum paraprotein quantitation",{"$f":"'Workload Data Entry'!C336","v":0}]
[null,null,null,null,null,null,"Workload-Individual-TotalTests-Q1-5-25","Total Tests - Immunochemistry Tests - Serum paraprotein immunotyping",{"$f":"'Workload Data Entry'!C337","v":0}]
[null,null,null,null,null,null,"Workload-Individual-TotalTests-Q1-5-26","Total Tests - Immunochemistry Tests - Serum paraprotein immunofixation",{"$f":"'Workload Data Entry'!C338","v":0}]
[null,null,null,null,null,null,"Workload-Individual-TotalTests-Q1-5-27","Total Tests - Immunochemistry Tests - Urine electrophoresis",{"$f":"'Workload Data Entry'!C339","v":0}]
[null,null,null,null,null,null,"Workload-Individual-TotalTests-Q1-5-28","Total Tests - Immunochemistry Tests - Urine immunofixation",{"$f":"'Workload Data Entry'!C340","v":0}]
[null,null,null,null,null,null,"Workload-Individual-TotalTests-Q1-5-29","Total Tests - Immunochemistry Tests - VEGF",{"$f":"'Workload Data Entry'!C341","v":0}]
[null,null,null,null,null,null,"Workload-Individual-TotalTests-Q1-5-30","Total Tests - Immunochemistry Tests - Total Immunochemistry Tests",{"$f":"'Workload Data Entry'!C342","v":0}]
[null,null,null,null,null,null,"Workload-Individual-TotalTests-Q1-6-1","Total Tests - Other Chemistry Tests - Bloodspot 17-OHProgesterone",{"$f":"'Workload Data Entry'!C345","v":0}]
[null,null,null,null,null,null,"Workload-Individual-TotalTests-Q1-6-2","Total Tests - Other Chemistry Tests - Faecal Calprotectin",{"$f":"'Workload Data Entry'!C346","v":0}]
[null,null,null,null,null,null,"Workload-Individual-TotalTests-Q1-6-3","Total Tests - Other Chemistry Tests - Faecal chromatography",{"$f":"'Workload Data Entry'!C347","v":0}]
[null,null,null,null,null,null,"Workload-Individual-TotalTests-Q1-6-4","Total Tests - Other Chemistry Tests - Faecal Elastase",{"$f":"'Workload Data Entry'!C348","v":0}]
[null,null,null,null,null,null,"Workload-Individual-TotalTests-Q1-6-5","Total Tests - Other Chemistry Tests - Faecal Fat",{"$f":"'Workload Data Entry'!C349","v":0}]
[null,null,null,null,null,null,"Workload-Individual-TotalTests-Q1-6-6","Total Tests - Other Chemistry Tests - Faecal Immunochemical Tests (FIT)",{"$f":"'Workload Data Entry'!C350","v":0}]
[null,null,null,null,null,null,"Workload-Individual-TotalTests-Q1-6-7","Total Tests - Other Chemistry Tests - Faecal Occult Blood (non-immuno)",{"$f":"'Workload Data Entry'!C351","v":0}]
[null,null,null,null,null,null,"Workload-Individual-TotalTests-Q1-6-8","Total Tests - Other Chemistry Tests - Faecal Ph",{"$f":"'Workload Data Entry'!C352","v":0}]
[null,null,null,null,null,null,"Workload-Individual-TotalTests-Q1-6-9","Total Tests - Other Chemistry Tests - Faecal reducing substances",{"$f":"'Workload Data Entry'!C353","v":0}]
[null,null,null,null,null,null,"Workload-Individual-TotalTests-Q1-6-10","Total Tests - Other Chemistry Tests - Faecal Total Porphyrins",{"$f":"'Workload Data Entry'!C354","v":0}]
[null,null,null,null,null,null,"Workload-Individual-TotalTests-Q1-6-11","Total Tests - Other Chemistry Tests - Faecal Weight",{"$f":"'Workload Data Entry'!C355","v":0}]
[null,null,null,null,null,null,"Workload-Individual-TotalTests-Q1-6-12","Total Tests - Other Chemistry Tests - Immuno-reactive trypsin",{"$f":"'Workload Data Entry'!C356","v":0}]
[null,null,null,null,null,null,"Workload-Individual-TotalTests-Q1-6-13","Total Tests - Other Chemistry Tests - Liver Iron",{"$f":"'Workload Data Entry'!C357","v":0}]
[null,null,null,null,null,null,"Workload-Individual-TotalTests-Q1-6-14","Total Tests - Other Chemistry Tests - Renal Calculus",{"$f":"'Workload Data Entry'!C358","v":0}]
[null,null,null,null,null,null,"Workload-Individual-TotalTests-Q1-6-15","Total Tests - Other Chemistry Tests - Urea Breath Test",{"$f":"'Workload Data Entry'!C359","v":0}]
[null,null,null,null,null,null,"Workload-Individual-TotalTests-Q1-6-16","Total Tests - Other Chemistry Tests - Total Other Chemistry Tests",{"$f":"'Workload Data Entry'!C360","v":0}]
[null,null,null,null,null,null,"Workload-Individual-TotalTests-Q1-7-1","Total Tests - Autoimmune Serology Tests - 68kD inner ear protein antibodies",{"$f":"'Workload Data Entry'!C364","v":0}]
[null,null,null,null,null,null,"Workload-Individual-TotalTests-Q1-7-2","Total Tests - Autoimmune Serology Tests - Acetyl choline receptor antibodies",{"$f":"'Workload Data Entry'!C365","v":0}]
[null,null,null,null,null,null,"Workload-Individual-TotalTests-Q1-7-3","Total Tests - Autoimmune Serology Tests - Adrenal antibodies",{"$f":"'Workload Data Entry'!C366","v":0}]
[null,null,null,null,null,null,"Workload-Individual-TotalTests-Q1-7-4","Total Tests - Autoimmune Serology Tests - AMPA 1 & 2 antibodies",{"$f":"'Workload Data Entry'!C367","v":0}]
[null,null,null,null,null,null,"Workload-Individual-TotalTests-Q1-7-5","Total Tests - Autoimmune Serology Tests - ANA screen on Hep2/Hep2000",{"$f":"'Workload Data Entry'!C368","v":0}]
[null,null,null,null,null,null,"Workload-Individual-TotalTests-Q1-7-6","Total Tests - Autoimmune Serology Tests - ANA screen on other substrate",{"$f":"'Workload Data Entry'!C369","v":0}]
[null,null,null,null,null,null,"Workload-Individual-TotalTests-Q1-7-7","Total Tests - Autoimmune Serology Tests - ANA titre on Hep2/Hep2000/other substrate (one test per sample NOT each dilution)",{"$f":"'Workload Data Entry'!C370","v":0}]
[null,null,null,null,null,null,"Workload-Individual-TotalTests-Q1-7-8","Total Tests - Autoimmune Serology Tests - ANCA  - immunoassay for PR3 antibodies = 1 test",{"$f":"'Workload Data Entry'!C371","v":0}]
[null,null,null,null,null,null,"Workload-Individual-TotalTests-Q1-7-9","Total Tests - Autoimmune Serology Tests - ANCA - immunoassay for MPO antbodies = 1 test",{"$f":"'Workload Data Entry'!C372","v":0}]
[null,null,null,null,null,null,"Workload-Individual-TotalTests-Q1-7-10","Total Tests - Autoimmune Serology Tests - ANCA by indirect immunofluorescence = 1 test",{"$f":"'Workload Data Entry'!C373","v":0}]
[null,null,null,null,null,null,"Workload-Individual-TotalTests-Q1-7-11","Total Tests - Autoimmune Serology Tests - Aquaporin 4 antibodies",{"$f":"'Workload Data Entry'!C374","v":0}]
[null,null,null,null,null,null,"Workload-Individual-TotalTests-Q1-7-12","Total Tests - Autoimmune Serology Tests - Basal ganglia antibodies",{"$f":"'Workload Data Entry'!C375","v":0}]
[null,null,null,null,null,null,"Workload-Individual-TotalTests-Q1-7-13","Total Tests - Autoimmune Serology Tests - Beta-2 glycoprotein 1 antibodies (IgG)",{"$f":"'Workload Data Entry'!C376","v":0}]
[null,null,null,null,null,null,"Workload-Individual-TotalTests-Q1-7-14","Total Tests - Autoimmune Serology Tests - Beta-2 glycoprotein 1 antibodies (IgM)",{"$f":"'Workload Data Entry'!C377","v":0}]
[null,null,null,null,null,null,"Workload-Individual-TotalTests-Q1-7-15","Total Tests - Autoimmune Serology Tests - Biological antibodies (e.g. infliximab antibodies)",{"$f":"'Workload Data Entry'!C378","v":0}]
[null,null,null,null,null,null,"Workload-Individual-TotalTests-Q1-7-16","Total Tests - Autoimmune Serology Tests - Biological levels (e.g. infliximab levels)",{"$f":"'Workload Data Entry'!C379","v":0}]
[null,null,null,null,null,null,"Workload-Individual-TotalTests-Q1-7-17","Total Tests - Autoimmune Serology Tests - C1q antibodies",{"$f":"'Workload Data Entry'!C380","v":0}]
[null,null,null,null,null,null,"Workload-Individual-TotalTests-Q1-7-18","Total Tests - Autoimmune Serology Tests - C3 nephritic factor",{"$f":"'Workload Data Entry'!C381","v":0}]
[null,null,null,null,null,null,"Workload-Individual-TotalTests-Q1-7-19","Total Tests - Autoimmune Serology Tests - Cardiac muscle antibodies",{"$f":"'Workload Data Entry'!C382","v":0}]
[null,null,null,null,null,null,"Workload-Individual-TotalTests-Q1-7-20","Total Tests - Autoimmune Serology Tests - Cardiolipin antibodies (IgG)",{"$f":"'Workload Data Entry'!C383","v":0}]
[null,null,null,null,null,null,"Workload-Individual-TotalTests-Q1-7-21","Total Tests - Autoimmune Serology Tests - Cardiolipin antibodies (IgM)",{"$f":"'Workload Data Entry'!C384","v":0}]
[null,null,null,null,null,null,"Workload-Individual-TotalTests-Q1-7-22","Total Tests - Autoimmune Serology Tests - CASPR2 antibodies",{"$f":"'Workload Data Entry'!C385","v":0}]
[null,null,null,null,null,null,"Workload-Individual-TotalTests-Q1-7-23","Total Tests - Autoimmune Serology Tests - Centromere B (CENPB) antibodies - by immunoassay/blot not IIF",{"$f":"'Workload Data Entry'!C386","v":0}]
[null,null,null,null,null,null,"Workload-Individual-TotalTests-Q1-7-24","Total Tests - Autoimmune Serology Tests - Connective tissue disease (CTD) screen (one test per sample)",{"$f":"'Workload Data Entry'!C387","v":0}]
[null,null,null,null,null,null,"Workload-Individual-TotalTests-Q1-7-25","Total Tests - Autoimmune Serology Tests - Cyclic citrullinated proteins (CCP) antibodies",{"$f":"'Workload Data Entry'!C388","v":0}]
[null,null,null,null,null,null,"Workload-Individual-TotalTests-Q1-7-26","Total Tests - Autoimmune Serology Tests - Deamidated-gliadin antibodies",{"$f":"'Workload Data Entry'!C389","v":0}]
[null,null,null,null,null,null,"Workload-Individual-TotalTests-Q1-7-27","Total Tests - Autoimmune Serology Tests - DNA antibodies by immunoassay/ELISA",{"$f":"'Workload Data Entry'!C390","v":0}]
[null,null,null,null,null,null,"Workload-Individual-TotalTests-Q1-7-28","Total Tests - Autoimmune Serology Tests - DNA antibodies by indirect immunofluoresence (Crithidia)",{"$f":"'Workload Data Entry'!C391","v":0}]
[null,null,null,null,null,null,"Workload-Individual-TotalTests-Q1-7-29","Total Tests - Autoimmune Serology Tests - ENA screen (1 test per sample)",{"$f":"'Workload Data Entry'!C392","v":0}]
[null,null,null,null,null,null,"Workload-Individual-TotalTests-Q1-7-30","Total Tests - Autoimmune Serology Tests - Endomysial (IgA) antibodies",{"$f":"'Workload Data Entry'!C393","v":0}]
[null,null,null,null,null,null,"Workload-Individual-TotalTests-Q1-7-31","Total Tests - Autoimmune Serology Tests - Endomysial (IgG) antibodies",{"$f":"'Workload Data Entry'!C394","v":0}]
[null,null,null,null,null,null,"Workload-Individual-TotalTests-Q1-7-32","Total Tests - Autoimmune Serology Tests - Fibrallin antibodies",{"$f":"'Workload Data Entry'!C395","v":0}]
[null,null,null,null,null,null,"Workload-Individual-TotalTests-Q1-7-33","Total Tests - Autoimmune Serology Tests - GABA antibodies",{"$f":"'Workload Data Entry'!C396","v":0}]
[null,null,null,null,null,null,"Workload-Individual-TotalTests-Q1-7-34","Total Tests - Autoimmune Serology Tests - Ganglionic acetyl receptor antibodies",{"$f":"'Workload Data Entry'!C397","v":0}]
[null,null,null,null,null,null,"Workload-Individual-TotalTests-Q1-7-35","Total Tests - Autoimmune Serology Tests - Glomerular basement membrane (GBM) antibodies",{"$f":"'Workload Data Entry'!C398","v":0}]
[null,null,null,null,null,null,"Workload-Individual-TotalTests-Q1-7-36","Total Tests - Autoimmune Serology Tests - Glutamic acid decarboxylase (GAD) antibodies",{"$f":"'Workload Data Entry'!C399","v":0}]
[null,null,null,null,null,null,"Workload-Individual-TotalTests-Q1-7-37","Total Tests - Autoimmune Serology Tests - Glycine receptor antibodies",{"$f":"'Workload Data Entry'!C400","v":0}]
[null,null,null,null,null,null,"Workload-Individual-TotalTests-Q1-7-38","Total Tests - Autoimmune Serology Tests - Ganglioside antibodies",{"$f":"'Workload Data Entry'!C401","v":0}]
[null,null,null,null,null,null,"Workload-Individual-TotalTests-Q1-7-39","Total Tests - Autoimmune Serology Tests - Myelin associated glycoprotein (MAG) antibodies",{"$f":"'Workload Data Entry'!C402","v":0}]
[null,null,null,null,null,null,"Workload-Individual-TotalTests-Q1-7-40","Total Tests - Autoimmune Serology Tests - Beta interferon neutralising antibodies",{"$f":"'Workload Data Entry'!C403","v":0}]
[null,null,null,null,null,null,"Workload-Individual-TotalTests-Q1-7-41","Total Tests - Autoimmune Serology Tests - Granulocyte antibodies",{"$f":"'Workload Data Entry'!C404","v":0}]
[null,null,null,null,null,null,"Workload-Individual-TotalTests-Q1-7-42","Total Tests - Autoimmune Serology Tests - Histone antibodies",{"$f":"'Workload Data Entry'!C405","v":0}]
[null,null,null,null,null,null,"Workload-Individual-TotalTests-Q1-7-43","Total Tests - Autoimmune Serology Tests - HMCoA antibodies",{"$f":"'Workload Data Entry'!C406","v":0}]
[null,null,null,null,null,null,"Workload-Individual-TotalTests-Q1-7-44","Total Tests - Autoimmune Serology Tests - IA-2 antibodies",{"$f":"'Workload Data Entry'!C407","v":0}]
[null,null,null,null,null,null,"Workload-Individual-TotalTests-Q1-7-45","Total Tests - Autoimmune Serology Tests - ZnT8 antibodies",{"$f":"'Workload Data Entry'!C408","v":0}]
[null,null,null,null,null,null,"Workload-Individual-TotalTests-Q1-7-46","Total Tests - Autoimmune Serology Tests - Insulin antibodies",{"$f":"'Workload Data Entry'!C409","v":0}]
[null,null,null,null,null,null,"Workload-Individual-TotalTests-Q1-7-47","Total Tests - Autoimmune Serology Tests - Intrinsic factor antibodies",{"$f":"'Workload Data Entry'!C410","v":0}]
[null,null,null,null,null,null,"Workload-Individual-TotalTests-Q1-7-48","Total Tests - Autoimmune Serology Tests - Islet cell antibodies",{"$f":"'Workload Data Entry'!C411","v":0}]
[null,null,null,null,null,null,"Workload-Individual-TotalTests-Q1-7-49","Total Tests - Autoimmune Serology Tests - Jo-1 antibodies",{"$f":"'Workload Data Entry'!C412","v":0}]
[null,null,null,null,null,null,"Workload-Individual-TotalTests-Q1-7-50","Total Tests - Autoimmune Serology Tests - La antibodies",{"$f":"'Workload Data Entry'!C413","v":0}]
[null,null,null,null,null,null,"Workload-Individual-TotalTests-Q1-7-51","Total Tests - Autoimmune Serology Tests - LGIR1 antibodies",{"$f":"'Workload Data Entry'!C414","v":0}]
[null,null,null,null,null,null,"Workload-Individual-TotalTests-Q1-7-52","Total Tests - Autoimmune Serology Tests - Lig1 antibodies",{"$f":"'Workload Data Entry'!C415","v":0}]
[null,null,null,null,null,null,"Workload-Individual-TotalTests-Q1-7-53","Total Tests - Autoimmune Serology Tests - Liver & gastric parietal cell antibodies by indirect immunofluorescence",{"$f":"'Workload Data Entry'!C416","v":0}]
[null,null,null,null,null,null,"Workload-Individual-TotalTests-Q1-7-54","Total Tests - Autoimmune Serology Tests - Liver antibodies by immunoblot (1 test per sample)",{"$f":"'Workload Data Entry'!C417","v":0}]
[null,null,null,null,null,null,"Workload-Individual-TotalTests-Q1-7-55","Total Tests - Autoimmune Serology Tests - Liver antibody titrations (one test per sample NOT each dilution)",{"$f":"'Workload Data Entry'!C418","v":0}]
[null,null,null,null,null,null,"Workload-Individual-TotalTests-Q1-7-56","Total Tests - Autoimmune Serology Tests - Mi-2 antibodies",{"$f":"'Workload Data Entry'!C419","v":0}]
[null,null,null,null,null,null,"Workload-Individual-TotalTests-Q1-7-57","Total Tests - Autoimmune Serology Tests - MOGL antibodies",{"$f":"'Workload Data Entry'!C420","v":0}]
[null,null,null,null,null,null,"Workload-Individual-TotalTests-Q1-7-58","Total Tests - Autoimmune Serology Tests - Muscle specific kinase (MUSK) antibodies",{"$f":"'Workload Data Entry'!C421","v":0}]
[null,null,null,null,null,null,"Workload-Individual-TotalTests-Q1-7-59","Total Tests - Autoimmune Serology Tests - Myositis antibody panel by immunoblot (1 test per sample)",{"$f":"'Workload Data Entry'!C422","v":0}]
[null,null,null,null,null,null,"Workload-Individual-TotalTests-Q1-7-60","Total Tests - Autoimmune Serology Tests - Neuronal antibodies by indirect immunofluorescence",{"$f":"'Workload Data Entry'!C423","v":0}]
[null,null,null,null,null,null,"Workload-Individual-TotalTests-Q1-7-61","Total Tests - Autoimmune Serology Tests - Neuronal antibodies by immunoblot (1 test per sample)",{"$f":"'Workload Data Entry'!C424","v":0}]
[null,null,null,null,null,null,"Workload-Individual-TotalTests-Q1-7-62","Total Tests - Autoimmune Serology Tests - NMDA receptor antibodies",{"$f":"'Workload Data Entry'!C425","v":0}]
[null,null,null,null,null,null,"Workload-Individual-TotalTests-Q1-7-63","Total Tests - Autoimmune Serology Tests - Other anti-phospholipid antibodies",{"$f":"'Workload Data Entry'!C426","v":0}]
[null,null,null,null,null,null,"Workload-Individual-TotalTests-Q1-7-64","Total Tests - Autoimmune Serology Tests - Other autoantibodies by indirect fluorescence",{"$f":"'Workload Data Entry'!C427","v":0}]
[null,null,null,null,null,null,"Workload-Individual-TotalTests-Q1-7-65","Total Tests - Autoimmune Serology Tests - Parathyroid antibodies",{"$f":"'Workload Data Entry'!C428","v":0}]
[null,null,null,null,null,null,"Workload-Individual-TotalTests-Q1-7-66","Total Tests - Autoimmune Serology Tests - PCNA antibodies",{"$f":"'Workload Data Entry'!C429","v":0}]
[null,null,null,null,null,null,"Workload-Individual-TotalTests-Q1-7-67","Total Tests - Autoimmune Serology Tests - Phospholipase A2 (PLA2) receptor antibodies",{"$f":"'Workload Data Entry'!C430","v":0}]
[null,null,null,null,null,null,"Workload-Individual-TotalTests-Q1-7-68","Total Tests - Autoimmune Serology Tests - Pyruvate dehydrogenase (M2) antibodies",{"$f":"'Workload Data Entry'!C431","v":0}]
[null,null,null,null,null,null,"Workload-Individual-TotalTests-Q1-7-69","Total Tests - Autoimmune Serology Tests - Rheumatoid factor by latex agglutination",{"$f":"'Workload Data Entry'!C432","v":0}]
[null,null,null,null,null,null,"Workload-Individual-TotalTests-Q1-7-70","Total Tests - Autoimmune Serology Tests - Rheumatoid factor by quantitative assay",{"$f":"'Workload Data Entry'!C433","v":0}]
[null,null,null,null,null,null,"Workload-Individual-TotalTests-Q1-7-71","Total Tests - Autoimmune Serology Tests - Rheumatoid factor - follow up test",{"$f":"'Workload Data Entry'!C434","v":0}]
[null,null,null,null,null,null,"Workload-Individual-TotalTests-Q1-7-72","Total Tests - Autoimmune Serology Tests - Ribosomal P antibodies",{"$f":"'Workload Data Entry'!C435","v":0}]
[null,null,null,null,null,null,"Workload-Individual-TotalTests-Q1-7-73","Total Tests - Autoimmune Serology Tests - RNA polymerase III antibodies",{"$f":"'Workload Data Entry'!C436","v":0}]
[null,null,null,null,null,null,"Workload-Individual-TotalTests-Q1-7-74","Total Tests - Autoimmune Serology Tests - Ro52 antibodies",{"$f":"'Workload Data Entry'!C437","v":0}]
[null,null,null,null,null,null,"Workload-Individual-TotalTests-Q1-7-75","Total Tests - Autoimmune Serology Tests - Ro60 antibodies",{"$f":"'Workload Data Entry'!C438","v":0}]
[null,null,null,null,null,null,"Workload-Individual-TotalTests-Q1-7-76","Total Tests - Autoimmune Serology Tests - Scl70 antibodies",{"$f":"'Workload Data Entry'!C439","v":0}]
[null,null,null,null,null,null,"Workload-Individual-TotalTests-Q1-7-77","Total Tests - Autoimmune Serology Tests - Skeletal muscle antibodies",{"$f":"'Workload Data Entry'!C440","v":0}]
[null,null,null,null,null,null,"Workload-Individual-TotalTests-Q1-7-78","Total Tests - Autoimmune Serology Tests - Skin abs (ELISA e.g. DSG1/3, BP180/230)",{"$f":"'Workload Data Entry'!C441","v":0}]
[null,null,null,null,null,null,"Workload-Individual-TotalTests-Q1-7-79","Total Tests - Autoimmune Serology Tests - Skin antibodies (e.g. Pemphigus/goid) by indirect immunofluorescence",{"$f":"'Workload Data Entry'!C442","v":0}]
[null,null,null,null,null,null,"Workload-Individual-TotalTests-Q1-7-80","Total Tests - Autoimmune Serology Tests - Sm antibodies",{"$f":"'Workload Data Entry'!C443","v":0}]
[null,null,null,null,null,null,"Workload-Individual-TotalTests-Q1-7-81","Total Tests - Autoimmune Serology Tests - Steroid cell antibodies (Ovary/testes/adrenal antibodies)",{"$f":"'Workload Data Entry'!C444","v":0}]
[null,null,null,null,null,null,"Workload-Individual-TotalTests-Q1-7-82","Total Tests - Autoimmune Serology Tests - Submaxillary gland antibodies",{"$f":"'Workload Data Entry'!C445","v":0}]
[null,null,null,null,null,null,"Workload-Individual-TotalTests-Q1-7-83","Total Tests - Autoimmune Serology Tests - Thyroglobulin antibodies",{"$f":"'Workload Data Entry'!C446","v":0}]
[null,null,null,null,null,null,"Workload-Individual-TotalTests-Q1-7-84","Total Tests - Autoimmune Serology Tests - Thyroid peroxidase antobodies",{"$f":"'Workload Data Entry'!C447","v":0}]
[null,null,null,null,null,null,"Workload-Individual-TotalTests-Q1-7-85","Total Tests - Autoimmune Serology Tests - Tissue transglutaminase antibodies (IgA)",{"$f":"'Workload Data Entry'!C448","v":0}]
[null,null,null,null,null,null,"Workload-Individual-TotalTests-Q1-7-86","Total Tests - Autoimmune Serology Tests - Tissue transglutaminase antibodies (IgG)",{"$f":"'Workload Data Entry'!C449","v":0}]
[null,null,null,null,null,null,"Workload-Individual-TotalTests-Q1-7-87","Total Tests - Autoimmune Serology Tests - TSH receptor antibodies   ",{"$f":"'Workload Data Entry'!C450","v":0}]
[null,null,null,null,null,null,"Workload-Individual-TotalTests-Q1-7-88","Total Tests - Autoimmune Serology Tests - U1 RNP / 70kDa RNP antibodies",{"$f":"'Workload Data Entry'!C451","v":0}]
[null,null,null,null,null,null,"Workload-Individual-TotalTests-Q1-7-89","Total Tests - Autoimmune Serology Tests - Voltage gated calcium channel (VGCC) antibodies",{"$f":"'Workload Data Entry'!C452","v":0}]
[null,null,null,null,null,null,"Workload-Individual-TotalTests-Q1-7-90","Total Tests - Autoimmune Serology Tests - Voltage gated potassium channel (VGKC) antibodies",{"$f":"'Workload Data Entry'!C453","v":0}]
[null,null,null,null,null,null,"Workload-Individual-TotalTests-Q1-7-91","Total Tests - Autoimmune Serology Tests - Total Autoimmune Serology",{"$f":"'Workload Data Entry'!C454","v":0}]
[null,null,null,null,null,null,"Workload-Individual-TotalTests-Q1-8-1","Total Tests - Allergy Tests - Allergen Components Specific IgE",{"$f":"'Workload Data Entry'!C457","v":0}]
[null,null,null,null,null,null,"Workload-Individual-TotalTests-Q1-8-2","Total Tests - Allergy Tests - Allergen Specific IgE",{"$f":"'Workload Data Entry'!C458","v":0}]
[null,null,null,null,null,null,"Workload-Individual-TotalTests-Q1-8-3","Total Tests - Allergy Tests - IgE Total level",{"$f":"'Workload Data Entry'!C459","v":0}]
[null,null,null,null,null,null,"Workload-Individual-TotalTests-Q1-8-4","Total Tests - Allergy Tests - IgG precipitins (Aspergillus, Avian etc…)",{"$f":"'Workload Data Entry'!C460","v":0}]
[null,null,null,null,null,null,"Workload-Individual-TotalTests-Q1-8-5","Total Tests - Allergy Tests - ISAC Test",{"$f":"'Workload Data Entry'!C461","v":0}]
[null,null,null,null,null,null,"Workload-Individual-TotalTests-Q1-8-6","Total Tests - Allergy Tests - Tryptase",{"$f":"'Workload Data Entry'!C462","v":0}]
[null,null,null,null,null,null,"Workload-Individual-TotalTests-Q1-8-7","Total Tests - Allergy Tests - Total Allergy Tests",{"$f":"'Workload Data Entry'!C463","v":0}]
[null,null,null,null,null,null,"Workload-Individual-TotalTests-Q1-9-1","Total Tests - Microbial Serology for Immunocompetence Testing - Meningococcal antibody (MCA)",{"$f":"'Workload Data Entry'!C466","v":0}]
[null,null,null,null,null,null,"Workload-Individual-TotalTests-Q1-9-2","Total Tests - Microbial Serology for Immunocompetence Testing - Diphtheria antibody",{"$f":"'Workload Data Entry'!C467","v":0}]
[null,null,null,null,null,null,"Workload-Individual-TotalTests-Q1-9-3","Total Tests - Microbial Serology for Immunocompetence Testing - Haemophilus influenzae b antibody",{"$f":"'Workload Data Entry'!C468","v":0}]
[null,null,null,null,null,null,"Workload-Individual-TotalTests-Q1-9-4","Total Tests - Microbial Serology for Immunocompetence Testing - Pneumococcal antibody",{"$f":"'Workload Data Entry'!C469","v":0}]
[null,null,null,null,null,null,"Workload-Individual-TotalTests-Q1-9-5","Total Tests - Microbial Serology for Immunocompetence Testing - Pneumococcal serotype specific antibody response (PSSA)",{"$f":"'Workload Data Entry'!C470","v":0}]
[null,null,null,null,null,null,"Workload-Individual-TotalTests-Q1-9-6","Total Tests - Microbial Serology for Immunocompetence Testing - Tetanus antibody",{"$f":"'Workload Data Entry'!C471","v":0}]
[null,null,null,null,null,null,"Workload-Individual-TotalTests-Q1-9-7","Total Tests - Microbial Serology for Immunocompetence Testing - Total Microbial Serology for Immunocompetence Testing",{"$f":"'Workload Data Entry'!C472","v":0}]
[null,null,null,null,null,null,"Workload-Individual-TotalTests-Q1-10-1","Total Tests - Cellular Immunology - B-cell phenotyping for common variable immunodeficiency (IgD/CD27)",{"$f":"'Workload Data Entry'!C475","v":0}]
[null,null,null,null,null,null,"Workload-Individual-TotalTests-Q1-10-2","Total Tests - Cellular Immunology - Cytokine functional studies",{"$f":"'Workload Data Entry'!C476","v":0}]
[null,null,null,null,null,null,"Workload-Individual-TotalTests-Q1-10-3","Total Tests - Cellular Immunology - Gamma interferon assays for TB: in-house assay",{"$f":"'Workload Data Entry'!C477","v":0}]
[null,null,null,null,null,null,"Workload-Individual-TotalTests-Q1-10-4","Total Tests - Cellular Immunology - Gamma interferon assays for TB: quantiferon",{"$f":"'Workload Data Entry'!C478","v":0}]
[null,null,null,null,null,null,"Workload-Individual-TotalTests-Q1-10-5","Total Tests - Cellular Immunology - Gamma interferon assays for TB: T-spot",{"$f":"'Workload Data Entry'!C479","v":0}]
[null,null,null,null,null,null,"Workload-Individual-TotalTests-Q1-10-6","Total Tests - Cellular Immunology - Lymphocyte function assays",{"$f":"'Workload Data Entry'!C480","v":0}]
[null,null,null,null,null,null,"Workload-Individual-TotalTests-Q1-10-7","Total Tests - Cellular Immunology - Specialised functional assays for primary immune deficiency (excluding genetics)",{"$f":"'Workload Data Entry'!C481","v":0}]
[null,null,null,null,null,null,"Workload-Individual-TotalTests-Q1-10-8","Total Tests - Cellular Immunology - Lymphocyte phenotyping/subset for PRIMARY immunodeficiency",{"$f":"'Workload Data Entry'!C482","v":0}]
[null,null,null,null,null,null,"Workload-Individual-TotalTests-Q1-10-9","Total Tests - Cellular Immunology - Lymphocyte phenotyping/subsets for HIV",{"$f":"'Workload Data Entry'!C483","v":0}]
[null,null,null,null,null,null,"Workload-Individual-TotalTests-Q1-10-10","Total Tests - Cellular Immunology - Lymphocyte phenotyping/subsets LEUKAEMIA/LYMPHOMA typing ",{"$f":"'Workload Data Entry'!C484","v":0}]
[null,null,null,null,null,null,"Workload-Individual-TotalTests-Q1-10-11","Total Tests - Cellular Immunology - Natural killer cell assay",{"$f":"'Workload Data Entry'!C485","v":0}]
[null,null,null,null,null,null,"Workload-Individual-TotalTests-Q1-10-12","Total Tests - Cellular Immunology - Neutrophil Adhesion Markers",{"$f":"'Workload Data Entry'!C486","v":0}]
[null,null,null,null,null,null,"Workload-Individual-TotalTests-Q1-10-13","Total Tests - Cellular Immunology - Neutrophil function",{"$f":"'Workload Data Entry'!C487","v":0}]
[null,null,null,null,null,null,"Workload-Individual-TotalTests-Q1-10-14","Total Tests - Cellular Immunology - Neutrophil respiratory burst by flow cytometry",{"$f":"'Workload Data Entry'!C488","v":0}]
[null,null,null,null,null,null,"Workload-Individual-TotalTests-Q1-10-15","Total Tests - Cellular Immunology - Neutrophil respiratory burst by NBT slide assay",{"$f":"'Workload Data Entry'!C489","v":0}]
[null,null,null,null,null,null,"Workload-Individual-TotalTests-Q1-10-16","Total Tests - Cellular Immunology - Total Cellular Immunology",{"$f":"'Workload Data Entry'!C490","v":0}]
[null,null,null,null,null,null,"Workload-Individual-TotalTests-Q1-11-1","Total Tests - Histocompatibility and Immunogenetics Tests - Crossmatching",{"$f":"'Workload Data Entry'!C493","v":0}]
[null,null,null,null,null,null,"Workload-Individual-TotalTests-Q1-11-2","Total Tests - Histocompatibility and Immunogenetics Tests - HFE typing",{"$f":"'Workload Data Entry'!C494","v":0}]
[null,null,null,null,null,null,"Workload-Individual-TotalTests-Q1-11-3","Total Tests - Histocompatibility and Immunogenetics Tests - HLA antibody characterisation",{"$f":"'Workload Data Entry'!C495","v":0}]
[null,null,null,null,null,null,"Workload-Individual-TotalTests-Q1-11-4","Total Tests - Histocompatibility and Immunogenetics Tests - HLA B27 typing flow cytometry",{"$f":"'Workload Data Entry'!C496","v":0}]
[null,null,null,null,null,null,"Workload-Individual-TotalTests-Q1-11-5","Total Tests - Histocompatibility and Immunogenetics Tests - HLA B57 ",{"$f":"'Workload Data Entry'!C497","v":0}]
[null,null,null,null,null,null,"Workload-Individual-TotalTests-Q1-11-6","Total Tests - Histocompatibility and Immunogenetics Tests - HLA Other Disease Association Allele Typing",{"$f":"'Workload Data Entry'!C498","v":0}]
[null,null,null,null,null,null,"Workload-Individual-TotalTests-Q1-11-7","Total Tests - Histocompatibility and Immunogenetics Tests - HLA class I A & B",{"$f":"'Workload Data Entry'!C499","v":0}]
[null,null,null,null,null,null,"Workload-Individual-TotalTests-Q1-11-8","Total Tests - Histocompatibility and Immunogenetics Tests - HLA class I Cw",{"$f":"'Workload Data Entry'!C500","v":0}]
[null,null,null,null,null,null,"Workload-Individual-TotalTests-Q1-11-9","Total Tests - Histocompatibility and Immunogenetics Tests - HLA class II DP",{"$f":"'Workload Data Entry'!C501","v":0}]
[null,null,null,null,null,null,"Workload-Individual-TotalTests-Q1-11-10","Total Tests - Histocompatibility and Immunogenetics Tests - HLA class II DQ",{"$f":"'Workload Data Entry'!C502","v":0}]
[null,null,null,null,null,null,"Workload-Individual-TotalTests-Q1-11-11","Total Tests - Histocompatibility and Immunogenetics Tests - HLA class II DR",{"$f":"'Workload Data Entry'!C503","v":0}]
[null,null,null,null,null,null,"Workload-Individual-TotalTests-Q1-11-12","Total Tests - Histocompatibility and Immunogenetics Tests - Total H&I Tests",{"$f":"'Workload Data Entry'!C504","v":0}]
[null,null,null,null,null,null,"Workload-Individual-TotalTests-Q1-12-1","Total Tests - Immunohistology - Total tests for Immunohistology",{"$f":"'Workload Data Entry'!C507","v":0}]
[null,null,null,null,null,null,"Workload-Individual-TotalTests-Q1-13-1","Total Tests - Routine Haematology - Blood film - no report(1)",{"$f":"'Workload Data Entry'!C511","v":0}]
[null,null,null,null,null,null,"Workload-Individual-TotalTests-Q1-13-2","Total Tests - Routine Haematology - Blood film - with report(1)",{"$f":"'Workload Data Entry'!C512","v":0}]
[null,null,null,null,null,null,"Workload-Individual-TotalTests-Q1-13-3","Total Tests - Routine Haematology - ESR",{"$f":"'Workload Data Entry'!C513","v":0}]
[null,null,null,null,null,null,"Workload-Individual-TotalTests-Q1-13-4","Total Tests - Routine Haematology - FBC",{"$f":"'Workload Data Entry'!C514","v":0}]
[null,null,null,null,null,null,"Workload-Individual-TotalTests-Q1-13-5","Total Tests - Routine Haematology - Glandular fever screening",{"$f":"'Workload Data Entry'!C515","v":0}]
[null,null,null,null,null,null,"Workload-Individual-TotalTests-Q1-13-6","Total Tests - Routine Haematology - Malaria parasite film",{"$f":"'Workload Data Entry'!C516","v":0}]
[null,null,null,null,null,null,"Workload-Individual-TotalTests-Q1-13-7","Total Tests - Routine Haematology - Other Malaria Tests",{"$f":"'Workload Data Entry'!C517","v":0}]
[null,null,null,null,null,null,"Workload-Individual-TotalTests-Q1-13-8","Total Tests - Routine Haematology - Plasma viscosity",{"$f":"'Workload Data Entry'!C518","v":0}]
[null,null,null,null,null,null,"Workload-Individual-TotalTests-Q1-13-9","Total Tests - Routine Haematology - Pregnancy test",{"$f":"'Workload Data Entry'!C519","v":0}]
[null,null,null,null,null,null,"Workload-Individual-TotalTests-Q1-13-10","Total Tests - Routine Haematology - Reticulocytes",{"$f":"'Workload Data Entry'!C520","v":0}]
[null,null,null,null,null,null,"Workload-Individual-TotalTests-Q1-13-11","Total Tests - Routine Haematology - Semen Analysis: fertility",{"$f":"'Workload Data Entry'!C521","v":0}]
[null,null,null,null,null,null,"Workload-Individual-TotalTests-Q1-13-12","Total Tests - Routine Haematology - Semen Analysis: post vasectomy",{"$f":"'Workload Data Entry'!C522","v":0}]
[null,null,null,null,null,null,"Workload-Individual-TotalTests-Q1-13-13","Total Tests - Routine Haematology - Total Routine Haematology",{"$f":"'Workload Data Entry'!C523","v":0}]
[null,null,null,null,null,null,"Workload-Individual-TotalTests-Q1-14-1","Total Tests - Bone Marrow Investigations - Aspirate",{"$f":"'Workload Data Entry'!C526","v":0}]
[null,null,null,null,null,null,"Workload-Individual-TotalTests-Q1-14-2","Total Tests - Bone Marrow Investigations - Cytogenetics, eg Not Molecular Diagnostics",{"$f":"'Workload Data Entry'!C527","v":0}]
[null,null,null,null,null,null,"Workload-Individual-TotalTests-Q1-14-3","Total Tests - Bone Marrow Investigations - Immunocytochemistry",{"$f":"'Workload Data Entry'!C528","v":0}]
[null,null,null,null,null,null,"Workload-Individual-TotalTests-Q1-14-4","Total Tests - Bone Marrow Investigations - Iron stains(2)",{"$f":"'Workload Data Entry'!C529","v":0}]
[null,null,null,null,null,null,"Workload-Individual-TotalTests-Q1-14-5","Total Tests - Bone Marrow Investigations - Other cytochemistry",{"$f":"'Workload Data Entry'!C530","v":0}]
[null,null,null,null,null,null,"Workload-Individual-TotalTests-Q1-14-6","Total Tests - Bone Marrow Investigations - Total Bone Marrow Investigations",{"$f":"'Workload Data Entry'!C531","v":0}]
[null,null,null,null,null,null,"Workload-Individual-TotalTests-Q1-14-7","Total Tests - Bone Marrow Investigations - Trephine biopsy",{"$f":"'Workload Data Entry'!C532","v":0}]
[null,null,null,null,null,null,"Workload-Individual-TotalTests-Q1-14-8","Total Tests - Bone Marrow Investigations - Total Bone Marrow Investigations",{"$f":"'Workload Data Entry'!C533","v":0}]
[null,null,null,null,null,null,"Workload-Individual-TotalTests-Q1-15-1","Total Tests - Coagulation - APC resistance",{"$f":"'Workload Data Entry'!C536","v":0}]
[null,null,null,null,null,null,"Workload-Individual-TotalTests-Q1-15-2","Total Tests - Coagulation - APTT",{"$f":"'Workload Data Entry'!C537","v":0}]
[null,null,null,null,null,null,"Workload-Individual-TotalTests-Q1-15-3","Total Tests - Coagulation - AT (Anti Thrombin)",{"$f":"'Workload Data Entry'!C538","v":0}]
[null,null,null,null,null,null,"Workload-Individual-TotalTests-Q1-15-4","Total Tests - Coagulation - Factor assay",{"$f":"'Workload Data Entry'!C539","v":0}]
[null,null,null,null,null,null,"Workload-Individual-TotalTests-Q1-15-5","Total Tests - Coagulation - Factor Xa",{"$f":"'Workload Data Entry'!C540","v":0}]
[null,null,null,null,null,null,"Workload-Individual-TotalTests-Q1-15-6","Total Tests - Coagulation - FDP/D Dimer",{"$f":"'Workload Data Entry'!C541","v":0}]
[null,null,null,null,null,null,"Workload-Individual-TotalTests-Q1-15-7","Total Tests - Coagulation - Fibrinogen: Clauss etc",{"$f":"'Workload Data Entry'!C542","v":0}]
[null,null,null,null,null,null,"Workload-Individual-TotalTests-Q1-15-8","Total Tests - Coagulation - Fibrinogen: derived",{"$f":"'Workload Data Entry'!C543","v":0}]
[null,null,null,null,null,null,"Workload-Individual-TotalTests-Q1-15-9","Total Tests - Coagulation - FV Leiden/Prothrombin G20210A",{"$f":"'Workload Data Entry'!C544","v":0}]
[null,null,null,null,null,null,"Workload-Individual-TotalTests-Q1-15-10","Total Tests - Coagulation - Inhibitor assay",{"$f":"'Workload Data Entry'!C545","v":0}]
[null,null,null,null,null,null,"Workload-Individual-TotalTests-Q1-15-11","Total Tests - Coagulation - Inhibitor screens (not lupus)",{"$f":"'Workload Data Entry'!C546","v":0}]
[null,null,null,null,null,null,"Workload-Individual-TotalTests-Q1-15-12","Total Tests - Coagulation - INR",{"$f":"'Workload Data Entry'!C547","v":0}]
[null,null,null,null,null,null,"Workload-Individual-TotalTests-Q1-15-13","Total Tests - Coagulation - Lupus Anticoagulant",{"$f":"'Workload Data Entry'!C548","v":0}]
[null,null,null,null,null,null,"Workload-Individual-TotalTests-Q1-15-14","Total Tests - Coagulation - NOAC Management",{"$f":"'Workload Data Entry'!C549","v":0}]
[null,null,null,null,null,null,"Workload-Individual-TotalTests-Q1-15-15","Total Tests - Coagulation - Platelet aggregation tests",{"$f":"'Workload Data Entry'!C550","v":0}]
[null,null,null,null,null,null,"Workload-Individual-TotalTests-Q1-15-16","Total Tests - Coagulation - Protein C",{"$f":"'Workload Data Entry'!C551","v":0}]
[null,null,null,null,null,null,"Workload-Individual-TotalTests-Q1-15-17","Total Tests - Coagulation - Protein S",{"$f":"'Workload Data Entry'!C552","v":0}]
[null,null,null,null,null,null,"Workload-Individual-TotalTests-Q1-15-18","Total Tests - Coagulation - PT",{"$f":"'Workload Data Entry'!C553","v":0}]
[null,null,null,null,null,null,"Workload-Individual-TotalTests-Q1-15-19","Total Tests - Coagulation - Reptilase time",{"$f":"'Workload Data Entry'!C554","v":0}]
[null,null,null,null,null,null,"Workload-Individual-TotalTests-Q1-15-20","Total Tests - Coagulation - Thrombin time",{"$f":"'Workload Data Entry'!C555","v":0}]
[null,null,null,null,null,null,"Workload-Individual-TotalTests-Q1-15-21","Total Tests - Coagulation - VWF multimer analysis",{"$f":"'Workload Data Entry'!C556","v":0}]
[null,null,null,null,null,null,"Workload-Individual-TotalTests-Q1-15-22","Total Tests - Coagulation - Section Subtotal - Coagulation",{"$f":"'Workload Data Entry'!C557","v":0}]
[null,null,null,null,null,null,"Workload-Individual-TotalTests-Q1-16-1","Total Tests - Haematinic Assays - Erythropoietin",{"$f":"'Workload Data Entry'!C560","v":0}]
[null,null,null,null,null,null,"Workload-Individual-TotalTests-Q1-16-2","Total Tests - Haematinic Assays - Vitamin B12 (active)",{"$f":"'Workload Data Entry'!C561","v":0}]
[null,null,null,null,null,null,"Workload-Individual-TotalTests-Q1-16-3","Total Tests - Haematinic Assays - Vitamin B12 (standard)",{"$f":"'Workload Data Entry'!C562","v":0}]
[null,null,null,null,null,null,"Workload-Individual-TotalTests-Q1-16-4","Total Tests - Haematinic Assays - Total Haematinic Assays",{"$f":"'Workload Data Entry'!C563","v":0}]
[null,null,null,null,null,null,"Workload-Individual-TotalTests-Q1-17-1","Total Tests - Blood Products and Blood Components - Albumin",{"$f":"'Workload Data Entry'!C566","v":0}]
[null,null,null,null,null,null,"Workload-Individual-TotalTests-Q1-17-2","Total Tests - Blood Products and Blood Components - Anti-D",{"$f":"'Workload Data Entry'!C567","v":0}]
[null,null,null,null,null,null,"Workload-Individual-TotalTests-Q1-17-3","Total Tests - Blood Products and Blood Components - Beriplex",{"$f":"'Workload Data Entry'!C568","v":0}]
[null,null,null,null,null,null,"Workload-Individual-TotalTests-Q1-17-4","Total Tests - Blood Products and Blood Components - Coagulation concentrate",{"$f":"'Workload Data Entry'!C569","v":0}]
[null,null,null,null,null,null,"Workload-Individual-TotalTests-Q1-17-5","Total Tests - Blood Products and Blood Components - Fibrinogen concentrate",{"$f":"'Workload Data Entry'!C570","v":0}]
[null,null,null,null,null,null,"Workload-Individual-TotalTests-Q1-17-6","Total Tests - Blood Products and Blood Components - Cryoprecipitate",{"$f":"'Workload Data Entry'!C571","v":0}]
[null,null,null,null,null,null,"Workload-Individual-TotalTests-Q1-17-7","Total Tests - Blood Products and Blood Components - Fresh frozen plasma",{"$f":"'Workload Data Entry'!C572","v":0}]
[null,null,null,null,null,null,"Workload-Individual-TotalTests-Q1-17-8","Total Tests - Blood Products and Blood Components - Intravenous immunoglobulin",{"$f":"'Workload Data Entry'!C573","v":0}]
[null,null,null,null,null,null,"Workload-Individual-TotalTests-Q1-17-9","Total Tests - Blood Products and Blood Components - No. of red blood cell units received from the blood transfusion service",{"$f":"'Workload Data Entry'!C574","v":0}]
[null,null,null,null,null,null,"Workload-Individual-TotalTests-Q1-17-10","Total Tests - Blood Products and Blood Components - NovoSeven",{"$f":"'Workload Data Entry'!C575","v":0}]
[null,null,null,null,null,null,"Workload-Individual-TotalTests-Q1-17-11","Total Tests - Blood Products and Blood Components - Platelets",{"$f":"'Workload Data Entry'!C576","v":0}]
[null,null,null,null,null,null,"Workload-Individual-TotalTests-Q1-17-12","Total Tests - Blood Products and Blood Components - Tetanus immunoglobulin",{"$f":"'Workload Data Entry'!C577","v":0}]
[null,null,null,null,null,null,"Workload-Individual-TotalTests-Q1-17-13","Total Tests - Blood Products and Blood Components - Viral Inactivated FFP",{"$f":"'Workload Data Entry'!C578","v":0}]
[null,null,null,null,null,null,"Workload-Individual-TotalTests-Q1-17-14","Total Tests - Blood Products and Blood Components - Total Blood Products and Blood Components",{"$f":"'Workload Data Entry'!C579","v":0}]
[null,null,null,null,null,null,"Workload-Individual-TotalTests-Q1-18-1","Total Tests - Blood Bank - Antenatal antibody screen",{"$f":"'Workload Data Entry'!C582","v":0}]
[null,null,null,null,null,null,"Workload-Individual-TotalTests-Q1-18-2","Total Tests - Blood Bank - Antibody identification - all other*",{"$f":"'Workload Data Entry'!C583","v":0}]
[null,null,null,null,null,null,"Workload-Individual-TotalTests-Q1-18-3","Total Tests - Blood Bank - Antibody identification due to prophylactic Anti-D*",{"$f":"'Workload Data Entry'!C584","v":0}]
[null,null,null,null,null,null,"Workload-Individual-TotalTests-Q1-18-4","Total Tests - Blood Bank - Antibody screen",{"$f":"'Workload Data Entry'!C585","v":0}]
[null,null,null,null,null,null,"Workload-Individual-TotalTests-Q1-18-5","Total Tests - Blood Bank - Blood group (see guidance notes)",{"$f":"'Workload Data Entry'!C586","v":0}]
[null,null,null,null,null,null,"Workload-Individual-TotalTests-Q1-18-6","Total Tests - Blood Bank - DCT",{"$f":"'Workload Data Entry'!C587","v":0}]
[null,null,null,null,null,null,"Workload-Individual-TotalTests-Q1-18-7","Total Tests - Blood Bank - Electronic crossmatch(3)",{"$f":"'Workload Data Entry'!C588","v":0}]
[null,null,null,null,null,null,"Workload-Individual-TotalTests-Q1-18-8","Total Tests - Blood Bank - Estimation of large FMH*",{"$f":"'Workload Data Entry'!C589","v":0}]
[null,null,null,null,null,null,"Workload-Individual-TotalTests-Q1-18-9","Total Tests - Blood Bank - Histocompatibility and Immunogenetics tests",{"$f":"'Workload Data Entry'!C590","v":0}]
[null,null,null,null,null,null,"Workload-Individual-TotalTests-Q1-18-10","Total Tests - Blood Bank - Kleihauer",{"$f":"'Workload Data Entry'!C591","v":0}]
[null,null,null,null,null,null,"Workload-Individual-TotalTests-Q1-18-11","Total Tests - Blood Bank - Traditional crossmatch(3)",{"$f":"'Workload Data Entry'!C592","v":0}]
[null,null,null,null,null,null,"Workload-Individual-TotalTests-Q1-18-12","Total Tests - Blood Bank - Total Blood Bank",{"$f":"'Workload Data Entry'!C593","v":0}]
[null,null,null,null,null,null,"Workload-Individual-TotalTests-Q1-19-1","Total Tests - Bone Marrow/Stem Cell Procedures - Bone marrow/stem cell manipulations",{"$f":"'Workload Data Entry'!C596","v":0}]
[null,null,null,null,null,null,"Workload-Individual-TotalTests-Q1-19-2","Total Tests - Bone Marrow/Stem Cell Procedures - Bone marrow/stem cell storage in your department",{"$f":"'Workload Data Entry'!C597","v":0}]
[null,null,null,null,null,null,"Workload-Individual-TotalTests-Q1-19-3","Total Tests - Bone Marrow/Stem Cell Procedures - Cell culture",{"$f":"'Workload Data Entry'!C598","v":0}]
[null,null,null,null,null,null,"Workload-Individual-TotalTests-Q1-19-4","Total Tests - Bone Marrow/Stem Cell Procedures - Total Bone Marrow/Stem Cell Procedures",{"$f":"'Workload Data Entry'!C599","v":0}]
[null,null,null,null,null,null,"Workload-Individual-TotalTests-Q1-20-1","Total Tests - Flow Cytometry - Flow cytometry - CD34",{"$f":"'Workload Data Entry'!C602","v":0}]
[null,null,null,null,null,null,"Workload-Individual-TotalTests-Q1-20-2","Total Tests - Flow Cytometry - Flow cytometry - MRD (Minimal Residual Disease)",{"$f":"'Workload Data Entry'!C603","v":0}]
[null,null,null,null,null,null,"Workload-Individual-TotalTests-Q1-20-3","Total Tests - Flow Cytometry - Flow cytometry - Platelets",{"$f":"'Workload Data Entry'!C604","v":0}]
[null,null,null,null,null,null,"Workload-Individual-TotalTests-Q1-20-4","Total Tests - Flow Cytometry - Section Subtotal - Flow Cytometry",{"$f":"'Workload Data Entry'!C605","v":0}]
[null,null,null,null,null,null,"Workload-Individual-TotalTests-Q1-21-1","Total Tests - Haemolytic Anaemia - G6PD",{"$f":"'Workload Data Entry'!C608","v":0}]
[null,null,null,null,null,null,"Workload-Individual-TotalTests-Q1-21-2","Total Tests - Haemolytic Anaemia - Haemoglobin A2",{"$f":"'Workload Data Entry'!C609","v":0}]
[null,null,null,null,null,null,"Workload-Individual-TotalTests-Q1-21-3","Total Tests - Haemolytic Anaemia - Haemoglobin electrophoresis",{"$f":"'Workload Data Entry'!C610","v":0}]
[null,null,null,null,null,null,"Workload-Individual-TotalTests-Q1-21-4","Total Tests - Haemolytic Anaemia - HbF",{"$f":"'Workload Data Entry'!C611","v":0}]
[null,null,null,null,null,null,"Workload-Individual-TotalTests-Q1-21-5","Total Tests - Haemolytic Anaemia - HPLC",{"$f":"'Workload Data Entry'!C612","v":0}]
[null,null,null,null,null,null,"Workload-Individual-TotalTests-Q1-21-6","Total Tests - Haemolytic Anaemia - Pyruvate kinase",{"$f":"'Workload Data Entry'!C613","v":0}]
[null,null,null,null,null,null,"Workload-Individual-TotalTests-Q1-21-7","Total Tests - Haemolytic Anaemia - Screening for HS",{"$f":"'Workload Data Entry'!C614","v":0}]
[null,null,null,null,null,null,"Workload-Individual-TotalTests-Q1-21-8","Total Tests - Haemolytic Anaemia - Sickle cell screening test",{"$f":"'Workload Data Entry'!C615","v":0}]
[null,null,null,null,null,null,"Workload-Individual-TotalTests-Q1-21-9","Total Tests - Haemolytic Anaemia - Total Haemolytic Anaemia",{"$f":"'Workload Data Entry'!C616","v":0}]
[null,null,null,null,null,null,"Workload-Individual-TotalTests-Q1-22-1","Total Tests - Radioisotopes - Plasma volume",{"$f":"'Workload Data Entry'!C619","v":0}]
[null,null,null,null,null,null,"Workload-Individual-TotalTests-Q1-22-2","Total Tests - Radioisotopes - Red cell mass",{"$f":"'Workload Data Entry'!C620","v":0}]
[null,null,null,null,null,null,"Workload-Individual-TotalTests-Q1-22-3","Total Tests - Radioisotopes - Schilling test",{"$f":"'Workload Data Entry'!C621","v":0}]
[null,null,null,null,null,null,"Workload-Individual-TotalTests-Q1-22-4","Total Tests - Radioisotopes - Total Radioisotopes",{"$f":"'Workload Data Entry'!C622","v":0}]
[null,null,null,null,null,null,"Workload-Individual-TotalTests-Q1-23-1","Total Tests - Molecular Tests - JAK - 2 mutations",{"$f":"'Workload Data Entry'!C625","v":0}]
[null,null,null,null,null,null,"Workload-Individual-TotalTests-Q1-23-2","Total Tests - Molecular Tests - PCR - bcr/abl monitoring",{"$f":"'Workload Data Entry'!C626","v":0}]
[null,null,null,null,null,null,"Workload-Individual-TotalTests-Q1-23-3","Total Tests - Molecular Tests - CALR",{"$f":"'Workload Data Entry'!C627","v":0}]
[null,null,null,null,null,null,"Workload-Individual-TotalTests-Q1-23-4","Total Tests - Molecular Tests - MPL",{"$f":"'Workload Data Entry'!C628","v":0}]
[null,null,null,null,null,null,"Workload-Individual-TotalTests-Q1-23-5","Total Tests - Molecular Tests - ASXL1",{"$f":"'Workload Data Entry'!C629","v":0}]
[null,null,null,null,null,null,"Workload-Individual-TotalTests-Q1-23-6","Total Tests - Molecular Tests - MYD88",{"$f":"'Workload Data Entry'!C630","v":0}]
[null,null,null,null,null,null,"Workload-Individual-TotalTests-Q1-23-7","Total Tests - Molecular Tests - Other Molecular Test 1",{"$f":"'Workload Data Entry'!C631","v":0}]
[null,null,null,null,null,null,"Workload-Individual-TotalTests-Q1-23-8","Total Tests - Molecular Tests - Other Molecular Test 2",{"$f":"'Workload Data Entry'!C632","v":0}]
[null,null,null,null,null,null,"Workload-Individual-TotalTests-Q1-23-9","Total Tests - Molecular Tests - Other Molecular Test 3",{"$f":"'Workload Data Entry'!C633","v":0}]
[null,null,null,null,null,null,"Workload-Individual-TotalTests-Q1-23-10","Total Tests - Molecular Tests - Other Molecular Test 4",{"$f":"'Workload Data Entry'!C634","v":0}]
[null,null,null,null,null,null,"Workload-Individual-TotalTests-Q1-23-11","Total Tests - Molecular Tests - Other Molecular Test 5",{"$f":"'Workload Data Entry'!C635","v":0}]
[null,null,null,null,null,null,"Workload-Individual-TotalTests-Q1-23-12","Total Tests - Molecular Tests - Other Molecular Test 6",{"$f":"'Workload Data Entry'!C636","v":0}]
[null,null,null,null,null,null,"Workload-Individual-TotalTests-Q1-23-13","Total Tests - Molecular Tests - Other Molecular Test 7",{"$f":"'Workload Data Entry'!C637","v":0}]
[null,null,null,null,null,null,"Workload-Individual-TotalTests-Q1-23-14","Total Tests - Molecular Tests - Other Molecular Test 8",{"$f":"'Workload Data Entry'!C638","v":0}]
[null,null,null,null,null,null,"Workload-Individual-TotalTests-Q1-23-15","Total Tests - Molecular Tests - Other Molecular Test 9",{"$f":"'Workload Data Entry'!C639","v":0}]
[null,null,null,null,null,null,"Workload-Individual-TotalTests-Q1-23-16","Total Tests - Molecular Tests - Other Molecular Test 10",{"$f":"'Workload Data Entry'!C640","v":0}]
[null,null,null,null,null,null,"Workload-Individual-TotalTests-Q1-23-17","Total Tests - Molecular Tests - Total Molecular Tests",{"$f":"'Workload Data Entry'!C641","v":0}]
[null,null,null,null,null,null,"Workload-Individual-TotalTests-Q1-24-1","Total Tests - Remaining Other Tests - Chemistry",{"$f":"'Workload Data Entry'!C644","v":0}]
[null,null,null,null,null,null,"Workload-Individual-TotalTests-Q1-24-2","Total Tests - Remaining Other Tests - Haematology (Incl Blood Transfusion)",{"$f":"'Workload Data Entry'!C646","v":0}]
[null,null,null,null,null,null,"Workload-Individual-TotalTests-Q1-24-3","Total Tests - Remaining Other Tests - Immunology",{"$f":"'Workload Data Entry'!C647","v":0}]
[null,null,null,null,null,null,"Workload-Individual-TotalTests-Q1-24-4","Total Tests - Remaining Other Tests - Combined Blood Sciences",{"$f":"'Workload Data Entry'!C648","v":0}]
[null,null,null,null,null,null,"Workload-Individual-RefOutTests-Q2-1-1","Tests Referred Out - Plasma/Serum/Blood - 1,25 Hydroxy Vitamin D",{"$f":"'Workload Data Entry'!D29","v":0}]
[null,null,null,null,null,null,"Workload-Individual-RefOutTests-Q2-1-2","Tests Referred Out - Plasma/Serum/Blood - 11-Deoxycortisol",{"$f":"'Workload Data Entry'!D30","v":0}]
[null,null,null,null,null,null,"Workload-Individual-RefOutTests-Q2-1-3","Tests Referred Out - Plasma/Serum/Blood - 17 Hydroxy Progesterone",{"$f":"'Workload Data Entry'!D31","v":0}]
[null,null,null,null,null,null,"Workload-Individual-RefOutTests-Q2-1-4","Tests Referred Out - Plasma/Serum/Blood - 25 Hydroxy Vitamin D",{"$f":"'Workload Data Entry'!D32","v":0}]
[null,null,null,null,null,null,"Workload-Individual-RefOutTests-Q2-1-5","Tests Referred Out - Plasma/Serum/Blood - ACTH",{"$f":"'Workload Data Entry'!D33","v":0}]
[null,null,null,null,null,null,"Workload-Individual-RefOutTests-Q2-1-6","Tests Referred Out - Plasma/Serum/Blood - Acyl Carnitine",{"$f":"'Workload Data Entry'!D34","v":0}]
[null,null,null,null,null,null,"Workload-Individual-RefOutTests-Q2-1-7","Tests Referred Out - Plasma/Serum/Blood - Adrenaline",{"$f":"'Workload Data Entry'!D35","v":0}]
[null,null,null,null,null,null,"Workload-Individual-RefOutTests-Q2-1-8","Tests Referred Out - Plasma/Serum/Blood - Albumin",{"$f":"'Workload Data Entry'!D36","v":0}]
[null,null,null,null,null,null,"Workload-Individual-RefOutTests-Q2-1-9","Tests Referred Out - Plasma/Serum/Blood - Alcohol (Ethanol)",{"$f":"'Workload Data Entry'!D37","v":0}]
[null,null,null,null,null,null,"Workload-Individual-RefOutTests-Q2-1-10","Tests Referred Out - Plasma/Serum/Blood - Aldosterone",{"$f":"'Workload Data Entry'!D38","v":0}]
[null,null,null,null,null,null,"Workload-Individual-RefOutTests-Q2-1-11","Tests Referred Out - Plasma/Serum/Blood - Alkaline phosphatase",{"$f":"'Workload Data Entry'!D39","v":0}]
[null,null,null,null,null,null,"Workload-Individual-RefOutTests-Q2-1-12","Tests Referred Out - Plasma/Serum/Blood - Alkaline phosphatase isoenzymes",{"$f":"'Workload Data Entry'!D40","v":0}]
[null,null,null,null,null,null,"Workload-Individual-RefOutTests-Q2-1-13","Tests Referred Out - Plasma/Serum/Blood - Alpha 1 Antitrypsin",{"$f":"'Workload Data Entry'!D41","v":0}]
[null,null,null,null,null,null,"Workload-Individual-RefOutTests-Q2-1-14","Tests Referred Out - Plasma/Serum/Blood - Alpha 1 Antitrypsin Phenotype",{"$f":"'Workload Data Entry'!D42","v":0}]
[null,null,null,null,null,null,"Workload-Individual-RefOutTests-Q2-1-15","Tests Referred Out - Plasma/Serum/Blood - Alpha-fetoprotein (non-Downs)",{"$f":"'Workload Data Entry'!D43","v":0}]
[null,null,null,null,null,null,"Workload-Individual-RefOutTests-Q2-1-16","Tests Referred Out - Plasma/Serum/Blood - ALT",{"$f":"'Workload Data Entry'!D44","v":0}]
[null,null,null,null,null,null,"Workload-Individual-RefOutTests-Q2-1-17","Tests Referred Out - Plasma/Serum/Blood - Aluminium",{"$f":"'Workload Data Entry'!D45","v":0}]
[null,null,null,null,null,null,"Workload-Individual-RefOutTests-Q2-1-18","Tests Referred Out - Plasma/Serum/Blood - Amino Acids",{"$f":"'Workload Data Entry'!D46","v":0}]
[null,null,null,null,null,null,"Workload-Individual-RefOutTests-Q2-1-19","Tests Referred Out - Plasma/Serum/Blood - Amiodarone",{"$f":"'Workload Data Entry'!D47","v":0}]
[null,null,null,null,null,null,"Workload-Individual-RefOutTests-Q2-1-20","Tests Referred Out - Plasma/Serum/Blood - Amitryptiline",{"$f":"'Workload Data Entry'!D48","v":0}]
[null,null,null,null,null,null,"Workload-Individual-RefOutTests-Q2-1-21","Tests Referred Out - Plasma/Serum/Blood - Ammonia",{"$f":"'Workload Data Entry'!D49","v":0}]
[null,null,null,null,null,null,"Workload-Individual-RefOutTests-Q2-1-22","Tests Referred Out - Plasma/Serum/Blood - Amylase",{"$f":"'Workload Data Entry'!D50","v":0}]
[null,null,null,null,null,null,"Workload-Individual-RefOutTests-Q2-1-23","Tests Referred Out - Plasma/Serum/Blood - Androstenedione",{"$f":"'Workload Data Entry'!D51","v":0}]
[null,null,null,null,null,null,"Workload-Individual-RefOutTests-Q2-1-24","Tests Referred Out - Plasma/Serum/Blood - Angiotensin Converting Enzyme",{"$f":"'Workload Data Entry'!D52","v":0}]
[null,null,null,null,null,null,"Workload-Individual-RefOutTests-Q2-1-25","Tests Referred Out - Plasma/Serum/Blood - Anti Mullerian hormone",{"$f":"'Workload Data Entry'!D53","v":0}]
[null,null,null,null,null,null,"Workload-Individual-RefOutTests-Q2-1-26","Tests Referred Out - Plasma/Serum/Blood - Anti thyroid peroxidase antibodies (TPO)",{"$f":"'Workload Data Entry'!D54","v":0}]
[null,null,null,null,null,null,"Workload-Individual-RefOutTests-Q2-1-27","Tests Referred Out - Plasma/Serum/Blood - Antibiotics (Gentamycin)",{"$f":"'Workload Data Entry'!D55","v":0}]
[null,null,null,null,null,null,"Workload-Individual-RefOutTests-Q2-1-28","Tests Referred Out - Plasma/Serum/Blood - Antibiotics (Other)",{"$f":"'Workload Data Entry'!D56","v":0}]
[null,null,null,null,null,null,"Workload-Individual-RefOutTests-Q2-1-29","Tests Referred Out - Plasma/Serum/Blood - Antibiotics (Tobramycin)",{"$f":"'Workload Data Entry'!D57","v":0}]
[null,null,null,null,null,null,"Workload-Individual-RefOutTests-Q2-1-30","Tests Referred Out - Plasma/Serum/Blood - Antibiotics (Vancomycin)",{"$f":"'Workload Data Entry'!D58","v":0}]
[null,null,null,null,null,null,"Workload-Individual-RefOutTests-Q2-1-31","Tests Referred Out - Plasma/Serum/Blood - Apo A1",{"$f":"'Workload Data Entry'!D59","v":0}]
[null,null,null,null,null,null,"Workload-Individual-RefOutTests-Q2-1-32","Tests Referred Out - Plasma/Serum/Blood - Apo B",{"$f":"'Workload Data Entry'!D60","v":0}]
[null,null,null,null,null,null,"Workload-Individual-RefOutTests-Q2-1-33","Tests Referred Out - Plasma/Serum/Blood - Apo E Genotype",{"$f":"'Workload Data Entry'!D61","v":0}]
[null,null,null,null,null,null,"Workload-Individual-RefOutTests-Q2-1-34","Tests Referred Out - Plasma/Serum/Blood - Arsenic",{"$f":"'Workload Data Entry'!D62","v":0}]
[null,null,null,null,null,null,"Workload-Individual-RefOutTests-Q2-1-35","Tests Referred Out - Plasma/Serum/Blood - Ascorbic acid (Leucocyte)",{"$f":"'Workload Data Entry'!D63","v":0}]
[null,null,null,null,null,null,"Workload-Individual-RefOutTests-Q2-1-36","Tests Referred Out - Plasma/Serum/Blood - AST",{"$f":"'Workload Data Entry'!D64","v":0}]
[null,null,null,null,null,null,"Workload-Individual-RefOutTests-Q2-1-37","Tests Referred Out - Plasma/Serum/Blood - B hydroxybutyrate",{"$f":"'Workload Data Entry'!D65","v":0}]
[null,null,null,null,null,null,"Workload-Individual-RefOutTests-Q2-1-38","Tests Referred Out - Plasma/Serum/Blood - B2 Microglobulin",{"$f":"'Workload Data Entry'!D66","v":0}]
[null,null,null,null,null,null,"Workload-Individual-RefOutTests-Q2-1-39","Tests Referred Out - Plasma/Serum/Blood - Bicarbonate",{"$f":"'Workload Data Entry'!D67","v":0}]
[null,null,null,null,null,null,"Workload-Individual-RefOutTests-Q2-1-40","Tests Referred Out - Plasma/Serum/Blood - Bile acids",{"$f":"'Workload Data Entry'!D68","v":0}]
[null,null,null,null,null,null,"Workload-Individual-RefOutTests-Q2-1-41","Tests Referred Out - Plasma/Serum/Blood - Bilirubin (Conjugated)",{"$f":"'Workload Data Entry'!D69","v":0}]
[null,null,null,null,null,null,"Workload-Individual-RefOutTests-Q2-1-42","Tests Referred Out - Plasma/Serum/Blood - Bilirubin (Total)",{"$f":"'Workload Data Entry'!D70","v":0}]
[null,null,null,null,null,null,"Workload-Individual-RefOutTests-Q2-1-43","Tests Referred Out - Plasma/Serum/Blood - Bismuth",{"$f":"'Workload Data Entry'!D71","v":0}]
[null,null,null,null,null,null,"Workload-Individual-RefOutTests-Q2-1-44","Tests Referred Out - Plasma/Serum/Blood - Blood Gas (count as 1 test, Exclude POCT)",{"$f":"'Workload Data Entry'!D72","v":0}]
[null,null,null,null,null,null,"Workload-Individual-RefOutTests-Q2-1-45","Tests Referred Out - Plasma/Serum/Blood - Blood Spot TSH",{"$f":"'Workload Data Entry'!D73","v":0}]
[null,null,null,null,null,null,"Workload-Individual-RefOutTests-Q2-1-46","Tests Referred Out - Plasma/Serum/Blood - BNP/NTproBNP",{"$f":"'Workload Data Entry'!D74","v":0}]
[null,null,null,null,null,null,"Workload-Individual-RefOutTests-Q2-1-47","Tests Referred Out - Plasma/Serum/Blood - Bone alkaline phosphatase",{"$f":"'Workload Data Entry'!D75","v":0}]
[null,null,null,null,null,null,"Workload-Individual-RefOutTests-Q2-1-48","Tests Referred Out - Plasma/Serum/Blood - CA 125",{"$f":"'Workload Data Entry'!D76","v":0}]
[null,null,null,null,null,null,"Workload-Individual-RefOutTests-Q2-1-49","Tests Referred Out - Plasma/Serum/Blood - CA 15-3",{"$f":"'Workload Data Entry'!D77","v":0}]
[null,null,null,null,null,null,"Workload-Individual-RefOutTests-Q2-1-50","Tests Referred Out - Plasma/Serum/Blood - CA 19-9",{"$f":"'Workload Data Entry'!D78","v":0}]
[null,null,null,null,null,null,"Workload-Individual-RefOutTests-Q2-1-51","Tests Referred Out - Plasma/Serum/Blood - Cadmium",{"$f":"'Workload Data Entry'!D79","v":0}]
[null,null,null,null,null,null,"Workload-Individual-RefOutTests-Q2-1-52","Tests Referred Out - Plasma/Serum/Blood - Caeruloplasmin",{"$f":"'Workload Data Entry'!D80","v":0}]
[null,null,null,null,null,null,"Workload-Individual-RefOutTests-Q2-1-53","Tests Referred Out - Plasma/Serum/Blood - Calcitonin",{"$f":"'Workload Data Entry'!D81","v":0}]
[null,null,null,null,null,null,"Workload-Individual-RefOutTests-Q2-1-54","Tests Referred Out - Plasma/Serum/Blood - Calcium",{"$f":"'Workload Data Entry'!D82","v":0}]
[null,null,null,null,null,null,"Workload-Individual-RefOutTests-Q2-1-55","Tests Referred Out - Plasma/Serum/Blood - Carbamazepine",{"$f":"'Workload Data Entry'!D83","v":0}]
[null,null,null,null,null,null,"Workload-Individual-RefOutTests-Q2-1-56","Tests Referred Out - Plasma/Serum/Blood - Carbohydrate Deficient transferrin",{"$f":"'Workload Data Entry'!D84","v":0}]
[null,null,null,null,null,null,"Workload-Individual-RefOutTests-Q2-1-57","Tests Referred Out - Plasma/Serum/Blood - Carboxyhaemoglobin",{"$f":"'Workload Data Entry'!D85","v":0}]
[null,null,null,null,null,null,"Workload-Individual-RefOutTests-Q2-1-58","Tests Referred Out - Plasma/Serum/Blood - Carotene",{"$f":"'Workload Data Entry'!D86","v":0}]
[null,null,null,null,null,null,"Workload-Individual-RefOutTests-Q2-1-59","Tests Referred Out - Plasma/Serum/Blood - Carotenoids (x1)",{"$f":"'Workload Data Entry'!D87","v":0}]
[null,null,null,null,null,null,"Workload-Individual-RefOutTests-Q2-1-60","Tests Referred Out - Plasma/Serum/Blood - CEA",{"$f":"'Workload Data Entry'!D88","v":0}]
[null,null,null,null,null,null,"Workload-Individual-RefOutTests-Q2-1-61","Tests Referred Out - Plasma/Serum/Blood - Chloride",{"$f":"'Workload Data Entry'!D89","v":0}]
[null,null,null,null,null,null,"Workload-Individual-RefOutTests-Q2-1-62","Tests Referred Out - Plasma/Serum/Blood - Cholesterol",{"$f":"'Workload Data Entry'!D90","v":0}]
[null,null,null,null,null,null,"Workload-Individual-RefOutTests-Q2-1-63","Tests Referred Out - Plasma/Serum/Blood - Cholinesterase",{"$f":"'Workload Data Entry'!D91","v":0}]
[null,null,null,null,null,null,"Workload-Individual-RefOutTests-Q2-1-64","Tests Referred Out - Plasma/Serum/Blood - Cholinesterase phenotype (count as 1 test)",{"$f":"'Workload Data Entry'!D92","v":0}]
[null,null,null,null,null,null,"Workload-Individual-RefOutTests-Q2-1-65","Tests Referred Out - Plasma/Serum/Blood - Chromium",{"$f":"'Workload Data Entry'!D93","v":0}]
[null,null,null,null,null,null,"Workload-Individual-RefOutTests-Q2-1-66","Tests Referred Out - Plasma/Serum/Blood - CK (Creatine Kinase)",{"$f":"'Workload Data Entry'!D94","v":0}]
[null,null,null,null,null,null,"Workload-Individual-RefOutTests-Q2-1-67","Tests Referred Out - Plasma/Serum/Blood - CKMB Enzymatic",{"$f":"'Workload Data Entry'!D95","v":0}]
[null,null,null,null,null,null,"Workload-Individual-RefOutTests-Q2-1-68","Tests Referred Out - Plasma/Serum/Blood - CKMB Mass",{"$f":"'Workload Data Entry'!D96","v":0}]
[null,null,null,null,null,null,"Workload-Individual-RefOutTests-Q2-1-69","Tests Referred Out - Plasma/Serum/Blood - Cobalt",{"$f":"'Workload Data Entry'!D97","v":0}]
[null,null,null,null,null,null,"Workload-Individual-RefOutTests-Q2-1-70","Tests Referred Out - Plasma/Serum/Blood - Copper",{"$f":"'Workload Data Entry'!D98","v":0}]
[null,null,null,null,null,null,"Workload-Individual-RefOutTests-Q2-1-71","Tests Referred Out - Plasma/Serum/Blood - Cortisol",{"$f":"'Workload Data Entry'!D99","v":0}]
[null,null,null,null,null,null,"Workload-Individual-RefOutTests-Q2-1-72","Tests Referred Out - Plasma/Serum/Blood - C-Reactive Protein",{"$f":"'Workload Data Entry'!D100","v":0}]
[null,null,null,null,null,null,"Workload-Individual-RefOutTests-Q2-1-73","Tests Referred Out - Plasma/Serum/Blood - Creatinine Enzymatic",{"$f":"'Workload Data Entry'!D101","v":0}]
[null,null,null,null,null,null,"Workload-Individual-RefOutTests-Q2-1-74","Tests Referred Out - Plasma/Serum/Blood - Creatinine JAFFE",{"$f":"'Workload Data Entry'!D102","v":0}]
[null,null,null,null,null,null,"Workload-Individual-RefOutTests-Q2-1-75","Tests Referred Out - Plasma/Serum/Blood - CTx",{"$f":"'Workload Data Entry'!D103","v":0}]
[null,null,null,null,null,null,"Workload-Individual-RefOutTests-Q2-1-76","Tests Referred Out - Plasma/Serum/Blood - Cyclic AMP",{"$f":"'Workload Data Entry'!D104","v":0}]
[null,null,null,null,null,null,"Workload-Individual-RefOutTests-Q2-1-77","Tests Referred Out - Plasma/Serum/Blood - Cyclosporin",{"$f":"'Workload Data Entry'!D105","v":0}]
[null,null,null,null,null,null,"Workload-Individual-RefOutTests-Q2-1-78","Tests Referred Out - Plasma/Serum/Blood - Cystatin",{"$f":"'Workload Data Entry'!D106","v":0}]
[null,null,null,null,null,null,"Workload-Individual-RefOutTests-Q2-1-79","Tests Referred Out - Plasma/Serum/Blood - DHAS/DHEAS",{"$f":"'Workload Data Entry'!D107","v":0}]
[null,null,null,null,null,null,"Workload-Individual-RefOutTests-Q2-1-80","Tests Referred Out - Plasma/Serum/Blood - Digoxin",{"$f":"'Workload Data Entry'!D108","v":0}]
[null,null,null,null,null,null,"Workload-Individual-RefOutTests-Q2-1-81","Tests Referred Out - Plasma/Serum/Blood - Dihydrotestosterone",{"$f":"'Workload Data Entry'!D109","v":0}]
[null,null,null,null,null,null,"Workload-Individual-RefOutTests-Q2-1-82","Tests Referred Out - Plasma/Serum/Blood - Dopamine",{"$f":"'Workload Data Entry'!D110","v":0}]
[null,null,null,null,null,null,"Workload-Individual-RefOutTests-Q2-1-83","Tests Referred Out - Plasma/Serum/Blood - Downs Screening",{"$f":"'Workload Data Entry'!D111","v":0}]
[null,null,null,null,null,null,"Workload-Individual-RefOutTests-Q2-1-84","Tests Referred Out - Plasma/Serum/Blood - Ethosuximide",{"$f":"'Workload Data Entry'!D112","v":0}]
[null,null,null,null,null,null,"Workload-Individual-RefOutTests-Q2-1-85","Tests Referred Out - Plasma/Serum/Blood - Ethylene Glycol",{"$f":"'Workload Data Entry'!D113","v":0}]
[null,null,null,null,null,null,"Workload-Individual-RefOutTests-Q2-1-86","Tests Referred Out - Plasma/Serum/Blood - Ferritin",{"$f":"'Workload Data Entry'!D114","v":0}]
[null,null,null,null,null,null,"Workload-Individual-RefOutTests-Q2-1-87","Tests Referred Out - Plasma/Serum/Blood - Flecainide",{"$f":"'Workload Data Entry'!D115","v":0}]
[null,null,null,null,null,null,"Workload-Individual-RefOutTests-Q2-1-88","Tests Referred Out - Plasma/Serum/Blood - Folate",{"$f":"'Workload Data Entry'!D116","v":0}]
[null,null,null,null,null,null,"Workload-Individual-RefOutTests-Q2-1-89","Tests Referred Out - Plasma/Serum/Blood - Folate (Red Cell)",{"$f":"'Workload Data Entry'!D117","v":0}]
[null,null,null,null,null,null,"Workload-Individual-RefOutTests-Q2-1-90","Tests Referred Out - Plasma/Serum/Blood - Fructosamine",{"$f":"'Workload Data Entry'!D118","v":0}]
[null,null,null,null,null,null,"Workload-Individual-RefOutTests-Q2-1-91","Tests Referred Out - Plasma/Serum/Blood - FSH",{"$f":"'Workload Data Entry'!D119","v":0}]
[null,null,null,null,null,null,"Workload-Individual-RefOutTests-Q2-1-92","Tests Referred Out - Plasma/Serum/Blood - Gamma Glutamyl Transferase",{"$f":"'Workload Data Entry'!D120","v":0}]
[null,null,null,null,null,null,"Workload-Individual-RefOutTests-Q2-1-93","Tests Referred Out - Plasma/Serum/Blood - Gastrin",{"$f":"'Workload Data Entry'!D121","v":0}]
[null,null,null,null,null,null,"Workload-Individual-RefOutTests-Q2-1-94","Tests Referred Out - Plasma/Serum/Blood - Glucagon",{"$f":"'Workload Data Entry'!D122","v":0}]
[null,null,null,null,null,null,"Workload-Individual-RefOutTests-Q2-1-95","Tests Referred Out - Plasma/Serum/Blood - Glucose",{"$f":"'Workload Data Entry'!D123","v":0}]
[null,null,null,null,null,null,"Workload-Individual-RefOutTests-Q2-1-96","Tests Referred Out - Plasma/Serum/Blood - Growth Hormone",{"$f":"'Workload Data Entry'!D124","v":0}]
[null,null,null,null,null,null,"Workload-Individual-RefOutTests-Q2-1-97","Tests Referred Out - Plasma/Serum/Blood - Gut hormone screen",{"$f":"'Workload Data Entry'!D125","v":0}]
[null,null,null,null,null,null,"Workload-Individual-RefOutTests-Q2-1-98","Tests Referred Out - Plasma/Serum/Blood - Haptoglobin",{"$f":"'Workload Data Entry'!D126","v":0}]
[null,null,null,null,null,null,"Workload-Individual-RefOutTests-Q2-1-99","Tests Referred Out - Plasma/Serum/Blood - HbA1c",{"$f":"'Workload Data Entry'!D127","v":0}]
[null,null,null,null,null,null,"Workload-Individual-RefOutTests-Q2-1-100","Tests Referred Out - Plasma/Serum/Blood - HCG (Non-Downs)",{"$f":"'Workload Data Entry'!D128","v":0}]
[null,null,null,null,null,null,"Workload-Individual-RefOutTests-Q2-1-101","Tests Referred Out - Plasma/Serum/Blood - HDL",{"$f":"'Workload Data Entry'!D129","v":0}]
[null,null,null,null,null,null,"Workload-Individual-RefOutTests-Q2-1-102","Tests Referred Out - Plasma/Serum/Blood - HFE Genotype (Haemochromatosis)",{"$f":"'Workload Data Entry'!D130","v":0}]
[null,null,null,null,null,null,"Workload-Individual-RefOutTests-Q2-1-103","Tests Referred Out - Plasma/Serum/Blood - Homocysteine",{"$f":"'Workload Data Entry'!D131","v":0}]
[null,null,null,null,null,null,"Workload-Individual-RefOutTests-Q2-1-104","Tests Referred Out - Plasma/Serum/Blood - IGF1",{"$f":"'Workload Data Entry'!D132","v":0}]
[null,null,null,null,null,null,"Workload-Individual-RefOutTests-Q2-1-105","Tests Referred Out - Plasma/Serum/Blood - IGFBP-3",{"$f":"'Workload Data Entry'!D133","v":0}]
[null,null,null,null,null,null,"Workload-Individual-RefOutTests-Q2-1-106","Tests Referred Out - Plasma/Serum/Blood - Inhibin A/B",{"$f":"'Workload Data Entry'!D134","v":0}]
[null,null,null,null,null,null,"Workload-Individual-RefOutTests-Q2-1-107","Tests Referred Out - Plasma/Serum/Blood - Insulin",{"$f":"'Workload Data Entry'!D135","v":0}]
[null,null,null,null,null,null,"Workload-Individual-RefOutTests-Q2-1-108","Tests Referred Out - Plasma/Serum/Blood - Insulin C-Peptide",{"$f":"'Workload Data Entry'!D136","v":0}]
[null,null,null,null,null,null,"Workload-Individual-RefOutTests-Q2-1-109","Tests Referred Out - Plasma/Serum/Blood - Iron",{"$f":"'Workload Data Entry'!D137","v":0}]
[null,null,null,null,null,null,"Workload-Individual-RefOutTests-Q2-1-110","Tests Referred Out - Plasma/Serum/Blood - Iron Binding Capacity",{"$f":"'Workload Data Entry'!D138","v":0}]
[null,null,null,null,null,null,"Workload-Individual-RefOutTests-Q2-1-111","Tests Referred Out - Plasma/Serum/Blood - Lactate",{"$f":"'Workload Data Entry'!D139","v":0}]
[null,null,null,null,null,null,"Workload-Individual-RefOutTests-Q2-1-112","Tests Referred Out - Plasma/Serum/Blood - Lamotrigine",{"$f":"'Workload Data Entry'!D140","v":0}]
[null,null,null,null,null,null,"Workload-Individual-RefOutTests-Q2-1-113","Tests Referred Out - Plasma/Serum/Blood - LDH",{"$f":"'Workload Data Entry'!D141","v":0}]
[null,null,null,null,null,null,"Workload-Individual-RefOutTests-Q2-1-114","Tests Referred Out - Plasma/Serum/Blood - LDL (Direct)",{"$f":"'Workload Data Entry'!D142","v":0}]
[null,null,null,null,null,null,"Workload-Individual-RefOutTests-Q2-1-115","Tests Referred Out - Plasma/Serum/Blood - Lead",{"$f":"'Workload Data Entry'!D143","v":0}]
[null,null,null,null,null,null,"Workload-Individual-RefOutTests-Q2-1-116","Tests Referred Out - Plasma/Serum/Blood - Leptin",{"$f":"'Workload Data Entry'!D144","v":0}]
[null,null,null,null,null,null,"Workload-Individual-RefOutTests-Q2-1-117","Tests Referred Out - Plasma/Serum/Blood - LH",{"$f":"'Workload Data Entry'!D145","v":0}]
[null,null,null,null,null,null,"Workload-Individual-RefOutTests-Q2-1-118","Tests Referred Out - Plasma/Serum/Blood - Lipoprotein Lipase",{"$f":"'Workload Data Entry'!D146","v":0}]
[null,null,null,null,null,null,"Workload-Individual-RefOutTests-Q2-1-119","Tests Referred Out - Plasma/Serum/Blood - Lithium",{"$f":"'Workload Data Entry'!D147","v":0}]
[null,null,null,null,null,null,"Workload-Individual-RefOutTests-Q2-1-120","Tests Referred Out - Plasma/Serum/Blood - Lp(a)",{"$f":"'Workload Data Entry'!D148","v":0}]
[null,null,null,null,null,null,"Workload-Individual-RefOutTests-Q2-1-121","Tests Referred Out - Plasma/Serum/Blood - Macroprolactin",{"$f":"'Workload Data Entry'!D149","v":0}]
[null,null,null,null,null,null,"Workload-Individual-RefOutTests-Q2-1-122","Tests Referred Out - Plasma/Serum/Blood - Magnesium",{"$f":"'Workload Data Entry'!D150","v":0}]
[null,null,null,null,null,null,"Workload-Individual-RefOutTests-Q2-1-123","Tests Referred Out - Plasma/Serum/Blood - Manganese",{"$f":"'Workload Data Entry'!D151","v":0}]
[null,null,null,null,null,null,"Workload-Individual-RefOutTests-Q2-1-124","Tests Referred Out - Plasma/Serum/Blood - Mercury",{"$f":"'Workload Data Entry'!D152","v":0}]
[null,null,null,null,null,null,"Workload-Individual-RefOutTests-Q2-1-125","Tests Referred Out - Plasma/Serum/Blood - Methaemoglobin",{"$f":"'Workload Data Entry'!D153","v":0}]
[null,null,null,null,null,null,"Workload-Individual-RefOutTests-Q2-1-126","Tests Referred Out - Plasma/Serum/Blood - Methanol",{"$f":"'Workload Data Entry'!D154","v":0}]
[null,null,null,null,null,null,"Workload-Individual-RefOutTests-Q2-1-127","Tests Referred Out - Plasma/Serum/Blood - Methotrexate",{"$f":"'Workload Data Entry'!D155","v":0}]
[null,null,null,null,null,null,"Workload-Individual-RefOutTests-Q2-1-128","Tests Referred Out - Plasma/Serum/Blood - Myoglobin",{"$f":"'Workload Data Entry'!D156","v":0}]
[null,null,null,null,null,null,"Workload-Individual-RefOutTests-Q2-1-129","Tests Referred Out - Plasma/Serum/Blood - Neurone Specific Enolase",{"$f":"'Workload Data Entry'!D157","v":0}]
[null,null,null,null,null,null,"Workload-Individual-RefOutTests-Q2-1-130","Tests Referred Out - Plasma/Serum/Blood - Noradrenaline",{"$f":"'Workload Data Entry'!D158","v":0}]
[null,null,null,null,null,null,"Workload-Individual-RefOutTests-Q2-1-131","Tests Referred Out - Plasma/Serum/Blood - Nortripyline",{"$f":"'Workload Data Entry'!D159","v":0}]
[null,null,null,null,null,null,"Workload-Individual-RefOutTests-Q2-1-132","Tests Referred Out - Plasma/Serum/Blood - Oestradiol",{"$f":"'Workload Data Entry'!D160","v":0}]
[null,null,null,null,null,null,"Workload-Individual-RefOutTests-Q2-1-133","Tests Referred Out - Plasma/Serum/Blood - Orosomucoid",{"$f":"'Workload Data Entry'!D161","v":0}]
[null,null,null,null,null,null,"Workload-Individual-RefOutTests-Q2-1-134","Tests Referred Out - Plasma/Serum/Blood - Osmolality",{"$f":"'Workload Data Entry'!D162","v":0}]
[null,null,null,null,null,null,"Workload-Individual-RefOutTests-Q2-1-135","Tests Referred Out - Plasma/Serum/Blood - Osteocalcein",{"$f":"'Workload Data Entry'!D163","v":0}]
[null,null,null,null,null,null,"Workload-Individual-RefOutTests-Q2-1-136","Tests Referred Out - Plasma/Serum/Blood - ELF Testing",{"$f":"'Workload Data Entry'!D164","v":0}]
[null,null,null,null,null,null,"Workload-Individual-RefOutTests-Q2-1-137","Tests Referred Out - Plasma/Serum/Blood - P111NP (Only those not already included in ELF testing)",{"$f":"'Workload Data Entry'!D165","v":0}]
[null,null,null,null,null,null,"Workload-Individual-RefOutTests-Q2-1-138","Tests Referred Out - Plasma/Serum/Blood - P1CP (bone markers)",{"$f":"'Workload Data Entry'!D166","v":0}]
[null,null,null,null,null,null,"Workload-Individual-RefOutTests-Q2-1-139","Tests Referred Out - Plasma/Serum/Blood - P1NP (bone markers)",{"$f":"'Workload Data Entry'!D167","v":0}]
[null,null,null,null,null,null,"Workload-Individual-RefOutTests-Q2-1-140","Tests Referred Out - Plasma/Serum/Blood - Pancreatic Polypeptide",{"$f":"'Workload Data Entry'!D168","v":0}]
[null,null,null,null,null,null,"Workload-Individual-RefOutTests-Q2-1-141","Tests Referred Out - Plasma/Serum/Blood - Paracetamol",{"$f":"'Workload Data Entry'!D169","v":0}]
[null,null,null,null,null,null,"Workload-Individual-RefOutTests-Q2-1-142","Tests Referred Out - Plasma/Serum/Blood - Phenobarbitone",{"$f":"'Workload Data Entry'!D170","v":0}]
[null,null,null,null,null,null,"Workload-Individual-RefOutTests-Q2-1-143","Tests Referred Out - Plasma/Serum/Blood - Phenytoin",{"$f":"'Workload Data Entry'!D171","v":0}]
[null,null,null,null,null,null,"Workload-Individual-RefOutTests-Q2-1-144","Tests Referred Out - Plasma/Serum/Blood - Phosphate",{"$f":"'Workload Data Entry'!D172","v":0}]
[null,null,null,null,null,null,"Workload-Individual-RefOutTests-Q2-1-145","Tests Referred Out - Plasma/Serum/Blood - PKU for Neonatal Screening",{"$f":"'Workload Data Entry'!D173","v":0}]
[null,null,null,null,null,null,"Workload-Individual-RefOutTests-Q2-1-146","Tests Referred Out - Plasma/Serum/Blood - Placental Alkaline Phosphatase",{"$f":"'Workload Data Entry'!D174","v":0}]
[null,null,null,null,null,null,"Workload-Individual-RefOutTests-Q2-1-147","Tests Referred Out - Plasma/Serum/Blood - Porphyrins",{"$f":"'Workload Data Entry'!D175","v":0}]
[null,null,null,null,null,null,"Workload-Individual-RefOutTests-Q2-1-148","Tests Referred Out - Plasma/Serum/Blood - Potassium",{"$f":"'Workload Data Entry'!D176","v":0}]
[null,null,null,null,null,null,"Workload-Individual-RefOutTests-Q2-1-149","Tests Referred Out - Plasma/Serum/Blood - Procalcitonin",{"$f":"'Workload Data Entry'!D177","v":0}]
[null,null,null,null,null,null,"Workload-Individual-RefOutTests-Q2-1-150","Tests Referred Out - Plasma/Serum/Blood - Progesterone",{"$f":"'Workload Data Entry'!D178","v":0}]
[null,null,null,null,null,null,"Workload-Individual-RefOutTests-Q2-1-151","Tests Referred Out - Plasma/Serum/Blood - Proinsulin",{"$f":"'Workload Data Entry'!D179","v":0}]
[null,null,null,null,null,null,"Workload-Individual-RefOutTests-Q2-1-152","Tests Referred Out - Plasma/Serum/Blood - Prolactin",{"$f":"'Workload Data Entry'!D180","v":0}]
[null,null,null,null,null,null,"Workload-Individual-RefOutTests-Q2-1-153","Tests Referred Out - Plasma/Serum/Blood - Protein S100",{"$f":"'Workload Data Entry'!D181","v":0}]
[null,null,null,null,null,null,"Workload-Individual-RefOutTests-Q2-1-154","Tests Referred Out - Plasma/Serum/Blood - PSA (Free)",{"$f":"'Workload Data Entry'!D182","v":0}]
[null,null,null,null,null,null,"Workload-Individual-RefOutTests-Q2-1-155","Tests Referred Out - Plasma/Serum/Blood - PSA (Total)",{"$f":"'Workload Data Entry'!D183","v":0}]
[null,null,null,null,null,null,"Workload-Individual-RefOutTests-Q2-1-156","Tests Referred Out - Plasma/Serum/Blood - PTH",{"$f":"'Workload Data Entry'!D184","v":0}]
[null,null,null,null,null,null,"Workload-Individual-RefOutTests-Q2-1-157","Tests Referred Out - Plasma/Serum/Blood - PTHrP",{"$f":"'Workload Data Entry'!D185","v":0}]
[null,null,null,null,null,null,"Workload-Individual-RefOutTests-Q2-1-158","Tests Referred Out - Plasma/Serum/Blood - Pyruvate",{"$f":"'Workload Data Entry'!D186","v":0}]
[null,null,null,null,null,null,"Workload-Individual-RefOutTests-Q2-1-159","Tests Referred Out - Plasma/Serum/Blood - Quantitative thyroid hormone binding",{"$f":"'Workload Data Entry'!D187","v":0}]
[null,null,null,null,null,null,"Workload-Individual-RefOutTests-Q2-1-160","Tests Referred Out - Plasma/Serum/Blood - Renin Activity",{"$f":"'Workload Data Entry'!D188","v":0}]
[null,null,null,null,null,null,"Workload-Individual-RefOutTests-Q2-1-161","Tests Referred Out - Plasma/Serum/Blood - Salicylate",{"$f":"'Workload Data Entry'!D189","v":0}]
[null,null,null,null,null,null,"Workload-Individual-RefOutTests-Q2-1-162","Tests Referred Out - Plasma/Serum/Blood - Selenium",{"$f":"'Workload Data Entry'!D190","v":0}]
[null,null,null,null,null,null,"Workload-Individual-RefOutTests-Q2-1-163","Tests Referred Out - Plasma/Serum/Blood - SHBG",{"$f":"'Workload Data Entry'!D191","v":0}]
[null,null,null,null,null,null,"Workload-Individual-RefOutTests-Q2-1-164","Tests Referred Out - Plasma/Serum/Blood - Sirolimus",{"$f":"'Workload Data Entry'!D192","v":0}]
[null,null,null,null,null,null,"Workload-Individual-RefOutTests-Q2-1-165","Tests Referred Out - Plasma/Serum/Blood - Sodium",{"$f":"'Workload Data Entry'!D193","v":0}]
[null,null,null,null,null,null,"Workload-Individual-RefOutTests-Q2-1-166","Tests Referred Out - Plasma/Serum/Blood - Somatostatin",{"$f":"'Workload Data Entry'!D194","v":0}]
[null,null,null,null,null,null,"Workload-Individual-RefOutTests-Q2-1-167","Tests Referred Out - Plasma/Serum/Blood - Sulphonylureas",{"$f":"'Workload Data Entry'!D195","v":0}]
[null,null,null,null,null,null,"Workload-Individual-RefOutTests-Q2-1-168","Tests Referred Out - Plasma/Serum/Blood - T3 (free)",{"$f":"'Workload Data Entry'!D196","v":0}]
[null,null,null,null,null,null,"Workload-Individual-RefOutTests-Q2-1-169","Tests Referred Out - Plasma/Serum/Blood - T3 (Total)",{"$f":"'Workload Data Entry'!D197","v":0}]
[null,null,null,null,null,null,"Workload-Individual-RefOutTests-Q2-1-170","Tests Referred Out - Plasma/Serum/Blood - T4 (Free)",{"$f":"'Workload Data Entry'!D198","v":0}]
[null,null,null,null,null,null,"Workload-Individual-RefOutTests-Q2-1-171","Tests Referred Out - Plasma/Serum/Blood - T4 (Total)",{"$f":"'Workload Data Entry'!D199","v":0}]
[null,null,null,null,null,null,"Workload-Individual-RefOutTests-Q2-1-172","Tests Referred Out - Plasma/Serum/Blood - Tacrolimus (FK 506)",{"$f":"'Workload Data Entry'!D200","v":0}]
[null,null,null,null,null,null,"Workload-Individual-RefOutTests-Q2-1-173","Tests Referred Out - Plasma/Serum/Blood - Testosterone",{"$f":"'Workload Data Entry'!D201","v":0}]
[null,null,null,null,null,null,"Workload-Individual-RefOutTests-Q2-1-174","Tests Referred Out - Plasma/Serum/Blood - Theophyline",{"$f":"'Workload Data Entry'!D202","v":0}]
[null,null,null,null,null,null,"Workload-Individual-RefOutTests-Q2-1-175","Tests Referred Out - Plasma/Serum/Blood - Thiamine Diphosphate",{"$f":"'Workload Data Entry'!D203","v":0}]
[null,null,null,null,null,null,"Workload-Individual-RefOutTests-Q2-1-176","Tests Referred Out - Plasma/Serum/Blood - Thyroglobulin",{"$f":"'Workload Data Entry'!D204","v":0}]
[null,null,null,null,null,null,"Workload-Individual-RefOutTests-Q2-1-177","Tests Referred Out - Plasma/Serum/Blood - Thyroid Binding Globulin",{"$f":"'Workload Data Entry'!D205","v":0}]
[null,null,null,null,null,null,"Workload-Individual-RefOutTests-Q2-1-178","Tests Referred Out - Plasma/Serum/Blood - Total Protein",{"$f":"'Workload Data Entry'!D206","v":0}]
[null,null,null,null,null,null,"Workload-Individual-RefOutTests-Q2-1-179","Tests Referred Out - Plasma/Serum/Blood - TPMT",{"$f":"'Workload Data Entry'!D207","v":0}]
[null,null,null,null,null,null,"Workload-Individual-RefOutTests-Q2-1-180","Tests Referred Out - Plasma/Serum/Blood - Transferrin",{"$f":"'Workload Data Entry'!D208","v":0}]
[null,null,null,null,null,null,"Workload-Individual-RefOutTests-Q2-1-181","Tests Referred Out - Plasma/Serum/Blood - Transketolase",{"$f":"'Workload Data Entry'!D209","v":0}]
[null,null,null,null,null,null,"Workload-Individual-RefOutTests-Q2-1-182","Tests Referred Out - Plasma/Serum/Blood - Triglyceride",{"$f":"'Workload Data Entry'!D210","v":0}]
[null,null,null,null,null,null,"Workload-Individual-RefOutTests-Q2-1-183","Tests Referred Out - Plasma/Serum/Blood - Troponin I",{"$f":"'Workload Data Entry'!D211","v":0}]
[null,null,null,null,null,null,"Workload-Individual-RefOutTests-Q2-1-184","Tests Referred Out - Plasma/Serum/Blood - Troponin T",{"$f":"'Workload Data Entry'!D212","v":0}]
[null,null,null,null,null,null,"Workload-Individual-RefOutTests-Q2-1-185","Tests Referred Out - Plasma/Serum/Blood - TSH (Routine)",{"$f":"'Workload Data Entry'!D213","v":0}]
[null,null,null,null,null,null,"Workload-Individual-RefOutTests-Q2-1-186","Tests Referred Out - Plasma/Serum/Blood - TSH Receptor AB",{"$f":"'Workload Data Entry'!D214","v":0}]
[null,null,null,null,null,null,"Workload-Individual-RefOutTests-Q2-1-187","Tests Referred Out - Plasma/Serum/Blood - Urea",{"$f":"'Workload Data Entry'!D215","v":0}]
[null,null,null,null,null,null,"Workload-Individual-RefOutTests-Q2-1-188","Tests Referred Out - Plasma/Serum/Blood - Uric Acid",{"$f":"'Workload Data Entry'!D216","v":0}]
[null,null,null,null,null,null,"Workload-Individual-RefOutTests-Q2-1-189","Tests Referred Out - Plasma/Serum/Blood - Valproate",{"$f":"'Workload Data Entry'!D217","v":0}]
[null,null,null,null,null,null,"Workload-Individual-RefOutTests-Q2-1-190","Tests Referred Out - Plasma/Serum/Blood - Vasoactive Intestinal Polypeptide",{"$f":"'Workload Data Entry'!D218","v":0}]
[null,null,null,null,null,null,"Workload-Individual-RefOutTests-Q2-1-191","Tests Referred Out - Plasma/Serum/Blood - Vitamin A",{"$f":"'Workload Data Entry'!D219","v":0}]
[null,null,null,null,null,null,"Workload-Individual-RefOutTests-Q2-1-192","Tests Referred Out - Plasma/Serum/Blood - Vitamin B6",{"$f":"'Workload Data Entry'!D220","v":0}]
[null,null,null,null,null,null,"Workload-Individual-RefOutTests-Q2-1-193","Tests Referred Out - Plasma/Serum/Blood - Vitamin C",{"$f":"'Workload Data Entry'!D221","v":0}]
[null,null,null,null,null,null,"Workload-Individual-RefOutTests-Q2-1-194","Tests Referred Out - Plasma/Serum/Blood - Vitamin E",{"$f":"'Workload Data Entry'!D222","v":0}]
[null,null,null,null,null,null,"Workload-Individual-RefOutTests-Q2-1-195","Tests Referred Out - Plasma/Serum/Blood - White cell enzymes",{"$f":"'Workload Data Entry'!D223","v":0}]
[null,null,null,null,null,null,"Workload-Individual-RefOutTests-Q2-1-196","Tests Referred Out - Plasma/Serum/Blood - Zinc",{"$f":"'Workload Data Entry'!D224","v":0}]
[null,null,null,null,null,null,"Workload-Individual-RefOutTests-Q2-1-197","Tests Referred Out - Plasma/Serum/Blood - Total Plasma/Serum/Blood Tests",{"$f":"'Workload Data Entry'!D225","v":0}]
[null,null,null,null,null,null,"Workload-Individual-RefOutTests-Q2-2-1","Tests Referred Out - Urine Drugs of Abuse - Amphetamine",{"$f":"'Workload Data Entry'!D228","v":0}]
[null,null,null,null,null,null,"Workload-Individual-RefOutTests-Q2-2-2","Tests Referred Out - Urine Drugs of Abuse - Barbiturates",{"$f":"'Workload Data Entry'!D229","v":0}]
[null,null,null,null,null,null,"Workload-Individual-RefOutTests-Q2-2-3","Tests Referred Out - Urine Drugs of Abuse - Benzodiazepine",{"$f":"'Workload Data Entry'!D230","v":0}]
[null,null,null,null,null,null,"Workload-Individual-RefOutTests-Q2-2-4","Tests Referred Out - Urine Drugs of Abuse - Buprenorphine",{"$f":"'Workload Data Entry'!D231","v":0}]
[null,null,null,null,null,null,"Workload-Individual-RefOutTests-Q2-2-5","Tests Referred Out - Urine Drugs of Abuse - Cannabis",{"$f":"'Workload Data Entry'!D232","v":0}]
[null,null,null,null,null,null,"Workload-Individual-RefOutTests-Q2-2-6","Tests Referred Out - Urine Drugs of Abuse - Cocaine",{"$f":"'Workload Data Entry'!D233","v":0}]
[null,null,null,null,null,null,"Workload-Individual-RefOutTests-Q2-2-7","Tests Referred Out - Urine Drugs of Abuse - GC/MS Confirmation",{"$f":"'Workload Data Entry'!D234","v":0}]
[null,null,null,null,null,null,"Workload-Individual-RefOutTests-Q2-2-8","Tests Referred Out - Urine Drugs of Abuse - LSD",{"$f":"'Workload Data Entry'!D235","v":0}]
[null,null,null,null,null,null,"Workload-Individual-RefOutTests-Q2-2-9","Tests Referred Out - Urine Drugs of Abuse - Methadone",{"$f":"'Workload Data Entry'!D236","v":0}]
[null,null,null,null,null,null,"Workload-Individual-RefOutTests-Q2-2-10","Tests Referred Out - Urine Drugs of Abuse - Opiates",{"$f":"'Workload Data Entry'!D237","v":0}]
[null,null,null,null,null,null,"Workload-Individual-RefOutTests-Q2-2-11","Tests Referred Out - Urine Drugs of Abuse - Rapid Slide test (e.g. Triage, InstAlert etc)",{"$f":"'Workload Data Entry'!D238","v":0}]
[null,null,null,null,null,null,"Workload-Individual-RefOutTests-Q2-2-12","Tests Referred Out - Urine Drugs of Abuse - TLC confirmation",{"$f":"'Workload Data Entry'!D239","v":0}]
[null,null,null,null,null,null,"Workload-Individual-RefOutTests-Q2-2-13","Tests Referred Out - Urine Drugs of Abuse - Total Urine Drugs of Abuse",{"$f":"'Workload Data Entry'!D240","v":0}]
[null,null,null,null,null,null,"Workload-Individual-RefOutTests-Q2-3-1","Tests Referred Out - Other Urine Tests - 5 Hydroxy Indole Acetic Acid",{"$f":"'Workload Data Entry'!D243","v":0}]
[null,null,null,null,null,null,"Workload-Individual-RefOutTests-Q2-3-2","Tests Referred Out - Other Urine Tests - Albumin/Microalbumin (urine)",{"$f":"'Workload Data Entry'!D244","v":0}]
[null,null,null,null,null,null,"Workload-Individual-RefOutTests-Q2-3-3","Tests Referred Out - Other Urine Tests - Alcohol",{"$f":"'Workload Data Entry'!D245","v":0}]
[null,null,null,null,null,null,"Workload-Individual-RefOutTests-Q2-3-4","Tests Referred Out - Other Urine Tests - Amino acid profiles (x1)",{"$f":"'Workload Data Entry'!D246","v":0}]
[null,null,null,null,null,null,"Workload-Individual-RefOutTests-Q2-3-5","Tests Referred Out - Other Urine Tests - Amylase",{"$f":"'Workload Data Entry'!D247","v":0}]
[null,null,null,null,null,null,"Workload-Individual-RefOutTests-Q2-3-6","Tests Referred Out - Other Urine Tests - B2 Microglobulin",{"$f":"'Workload Data Entry'!D248","v":0}]
[null,null,null,null,null,null,"Workload-Individual-RefOutTests-Q2-3-7","Tests Referred Out - Other Urine Tests - Bilirbubin",{"$f":"'Workload Data Entry'!D249","v":0}]
[null,null,null,null,null,null,"Workload-Individual-RefOutTests-Q2-3-8","Tests Referred Out - Other Urine Tests - Calcium",{"$f":"'Workload Data Entry'!D250","v":0}]
[null,null,null,null,null,null,"Workload-Individual-RefOutTests-Q2-3-9","Tests Referred Out - Other Urine Tests - Catecholamines (including metadrenaline), HPLC (count as 1 test)",{"$f":"'Workload Data Entry'!D251","v":0}]
[null,null,null,null,null,null,"Workload-Individual-RefOutTests-Q2-3-10","Tests Referred Out - Other Urine Tests - Chloride",{"$f":"'Workload Data Entry'!D252","v":0}]
[null,null,null,null,null,null,"Workload-Individual-RefOutTests-Q2-3-11","Tests Referred Out - Other Urine Tests - Copper",{"$f":"'Workload Data Entry'!D253","v":0}]
[null,null,null,null,null,null,"Workload-Individual-RefOutTests-Q2-3-12","Tests Referred Out - Other Urine Tests - Cortisol (UFC)",{"$f":"'Workload Data Entry'!D254","v":0}]
[null,null,null,null,null,null,"Workload-Individual-RefOutTests-Q2-3-13","Tests Referred Out - Other Urine Tests - Cotinine",{"$f":"'Workload Data Entry'!D255","v":0}]
[null,null,null,null,null,null,"Workload-Individual-RefOutTests-Q2-3-14","Tests Referred Out - Other Urine Tests - Creatinine",{"$f":"'Workload Data Entry'!D256","v":0}]
[null,null,null,null,null,null,"Workload-Individual-RefOutTests-Q2-3-15","Tests Referred Out - Other Urine Tests - Cystine",{"$f":"'Workload Data Entry'!D257","v":0}]
[null,null,null,null,null,null,"Workload-Individual-RefOutTests-Q2-3-16","Tests Referred Out - Other Urine Tests - DPD",{"$f":"'Workload Data Entry'!D258","v":0}]
[null,null,null,null,null,null,"Workload-Individual-RefOutTests-Q2-3-17","Tests Referred Out - Other Urine Tests - Glucose",{"$f":"'Workload Data Entry'!D259","v":0}]
[null,null,null,null,null,null,"Workload-Individual-RefOutTests-Q2-3-18","Tests Referred Out - Other Urine Tests - Iron",{"$f":"'Workload Data Entry'!D260","v":0}]
[null,null,null,null,null,null,"Workload-Individual-RefOutTests-Q2-3-19","Tests Referred Out - Other Urine Tests - Laxative screen",{"$f":"'Workload Data Entry'!D261","v":0}]
[null,null,null,null,null,null,"Workload-Individual-RefOutTests-Q2-3-20","Tests Referred Out - Other Urine Tests - Light Chains",{"$f":"'Workload Data Entry'!D262","v":0}]
[null,null,null,null,null,null,"Workload-Individual-RefOutTests-Q2-3-21","Tests Referred Out - Other Urine Tests - Magnesium",{"$f":"'Workload Data Entry'!D263","v":0}]
[null,null,null,null,null,null,"Workload-Individual-RefOutTests-Q2-3-22","Tests Referred Out - Other Urine Tests - Mercury",{"$f":"'Workload Data Entry'!D264","v":0}]
[null,null,null,null,null,null,"Workload-Individual-RefOutTests-Q2-3-23","Tests Referred Out - Other Urine Tests - Mucopolysaccharides",{"$f":"'Workload Data Entry'!D265","v":0}]
[null,null,null,null,null,null,"Workload-Individual-RefOutTests-Q2-3-24","Tests Referred Out - Other Urine Tests - Myoglobin",{"$f":"'Workload Data Entry'!D266","v":0}]
[null,null,null,null,null,null,"Workload-Individual-RefOutTests-Q2-3-25","Tests Referred Out - Other Urine Tests - NAG",{"$f":"'Workload Data Entry'!D267","v":0}]
[null,null,null,null,null,null,"Workload-Individual-RefOutTests-Q2-3-26","Tests Referred Out - Other Urine Tests - Nitrogen",{"$f":"'Workload Data Entry'!D268","v":0}]
[null,null,null,null,null,null,"Workload-Individual-RefOutTests-Q2-3-27","Tests Referred Out - Other Urine Tests - Normetadrenaline",{"$f":"'Workload Data Entry'!D269","v":0}]
[null,null,null,null,null,null,"Workload-Individual-RefOutTests-Q2-3-28","Tests Referred Out - Other Urine Tests - Organic acids",{"$f":"'Workload Data Entry'!D270","v":0}]
[null,null,null,null,null,null,"Workload-Individual-RefOutTests-Q2-3-29","Tests Referred Out - Other Urine Tests - Osmolality",{"$f":"'Workload Data Entry'!D271","v":0}]
[null,null,null,null,null,null,"Workload-Individual-RefOutTests-Q2-3-30","Tests Referred Out - Other Urine Tests - Oxalate",{"$f":"'Workload Data Entry'!D272","v":0}]
[null,null,null,null,null,null,"Workload-Individual-RefOutTests-Q2-3-31","Tests Referred Out - Other Urine Tests - Paraquat",{"$f":"'Workload Data Entry'!D273","v":0}]
[null,null,null,null,null,null,"Workload-Individual-RefOutTests-Q2-3-32","Tests Referred Out - Other Urine Tests - Phosphate",{"$f":"'Workload Data Entry'!D274","v":0}]
[null,null,null,null,null,null,"Workload-Individual-RefOutTests-Q2-3-33","Tests Referred Out - Other Urine Tests - Porphobilinogen",{"$f":"'Workload Data Entry'!D275","v":0}]
[null,null,null,null,null,null,"Workload-Individual-RefOutTests-Q2-3-34","Tests Referred Out - Other Urine Tests - Porphyrins",{"$f":"'Workload Data Entry'!D276","v":0}]
[null,null,null,null,null,null,"Workload-Individual-RefOutTests-Q2-3-35","Tests Referred Out - Other Urine Tests - Potassium",{"$f":"'Workload Data Entry'!D277","v":0}]
[null,null,null,null,null,null,"Workload-Individual-RefOutTests-Q2-3-36","Tests Referred Out - Other Urine Tests - Pregnancy Test (not by quantitation of HCG)",{"$f":"'Workload Data Entry'!D278","v":0}]
[null,null,null,null,null,null,"Workload-Individual-RefOutTests-Q2-3-37","Tests Referred Out - Other Urine Tests - Protein (24hr)",{"$f":"'Workload Data Entry'!D279","v":0}]
[null,null,null,null,null,null,"Workload-Individual-RefOutTests-Q2-3-38","Tests Referred Out - Other Urine Tests - Protein (reported as creatinine ratio)",{"$f":"'Workload Data Entry'!D280","v":0}]
[null,null,null,null,null,null,"Workload-Individual-RefOutTests-Q2-3-39","Tests Referred Out - Other Urine Tests - Reducing substances",{"$f":"'Workload Data Entry'!D281","v":0}]
[null,null,null,null,null,null,"Workload-Individual-RefOutTests-Q2-3-40","Tests Referred Out - Other Urine Tests - Sodium",{"$f":"'Workload Data Entry'!D282","v":0}]
[null,null,null,null,null,null,"Workload-Individual-RefOutTests-Q2-3-41","Tests Referred Out - Other Urine Tests - Steroid Profile (x1)",{"$f":"'Workload Data Entry'!D283","v":0}]
[null,null,null,null,null,null,"Workload-Individual-RefOutTests-Q2-3-42","Tests Referred Out - Other Urine Tests - Urate",{"$f":"'Workload Data Entry'!D284","v":0}]
[null,null,null,null,null,null,"Workload-Individual-RefOutTests-Q2-3-43","Tests Referred Out - Other Urine Tests - Urea",{"$f":"'Workload Data Entry'!D285","v":0}]
[null,null,null,null,null,null,"Workload-Individual-RefOutTests-Q2-3-44","Tests Referred Out - Other Urine Tests - Urine volume",{"$f":"'Workload Data Entry'!D286","v":0}]
[null,null,null,null,null,null,"Workload-Individual-RefOutTests-Q2-3-45","Tests Referred Out - Other Urine Tests - Urobilinogen",{"$f":"'Workload Data Entry'!D287","v":0}]
[null,null,null,null,null,null,"Workload-Individual-RefOutTests-Q2-3-46","Tests Referred Out - Other Urine Tests - Total Other Urine Tests",{"$f":"'Workload Data Entry'!D288","v":0}]
[null,null,null,null,null,null,"Workload-Individual-RefOutTests-Q2-4-1","Tests Referred Out - Fluids Tests - Albumin",{"$f":"'Workload Data Entry'!D291","v":0}]
[null,null,null,null,null,null,"Workload-Individual-RefOutTests-Q2-4-2","Tests Referred Out - Fluids Tests - Alpha-fetoprotein",{"$f":"'Workload Data Entry'!D292","v":0}]
[null,null,null,null,null,null,"Workload-Individual-RefOutTests-Q2-4-3","Tests Referred Out - Fluids Tests - Amylase",{"$f":"'Workload Data Entry'!D293","v":0}]
[null,null,null,null,null,null,"Workload-Individual-RefOutTests-Q2-4-4","Tests Referred Out - Fluids Tests - Creatinine",{"$f":"'Workload Data Entry'!D294","v":0}]
[null,null,null,null,null,null,"Workload-Individual-RefOutTests-Q2-4-5","Tests Referred Out - Fluids Tests - CSF Glucose",{"$f":"'Workload Data Entry'!D295","v":0}]
[null,null,null,null,null,null,"Workload-Individual-RefOutTests-Q2-4-6","Tests Referred Out - Fluids Tests - CSF IgG",{"$f":"'Workload Data Entry'!D296","v":0}]
[null,null,null,null,null,null,"Workload-Individual-RefOutTests-Q2-4-7","Tests Referred Out - Fluids Tests - CSF Protein",{"$f":"'Workload Data Entry'!D297","v":0}]
[null,null,null,null,null,null,"Workload-Individual-RefOutTests-Q2-4-8","Tests Referred Out - Fluids Tests - Glucose",{"$f":"'Workload Data Entry'!D298","v":0}]
[null,null,null,null,null,null,"Workload-Individual-RefOutTests-Q2-4-9","Tests Referred Out - Fluids Tests - HCG",{"$f":"'Workload Data Entry'!D299","v":0}]
[null,null,null,null,null,null,"Workload-Individual-RefOutTests-Q2-4-10","Tests Referred Out - Fluids Tests - Lactate Dehydrogenase",{"$f":"'Workload Data Entry'!D300","v":0}]
[null,null,null,null,null,null,"Workload-Individual-RefOutTests-Q2-4-11","Tests Referred Out - Fluids Tests - pH",{"$f":"'Workload Data Entry'!D301","v":0}]
[null,null,null,null,null,null,"Workload-Individual-RefOutTests-Q2-4-12","Tests Referred Out - Fluids Tests - Potassium",{"$f":"'Workload Data Entry'!D302","v":0}]
[null,null,null,null,null,null,"Workload-Individual-RefOutTests-Q2-4-13","Tests Referred Out - Fluids Tests - Protein",{"$f":"'Workload Data Entry'!D303","v":0}]
[null,null,null,null,null,null,"Workload-Individual-RefOutTests-Q2-4-14","Tests Referred Out - Fluids Tests - Sodium",{"$f":"'Workload Data Entry'!D304","v":0}]
[null,null,null,null,null,null,"Workload-Individual-RefOutTests-Q2-4-15","Tests Referred Out - Fluids Tests - Sweat Tests",{"$f":"'Workload Data Entry'!D305","v":0}]
[null,null,null,null,null,null,"Workload-Individual-RefOutTests-Q2-4-16","Tests Referred Out - Fluids Tests - Tau protein",{"$f":"'Workload Data Entry'!D306","v":0}]
[null,null,null,null,null,null,"Workload-Individual-RefOutTests-Q2-4-17","Tests Referred Out - Fluids Tests - Urate",{"$f":"'Workload Data Entry'!D307","v":0}]
[null,null,null,null,null,null,"Workload-Individual-RefOutTests-Q2-4-18","Tests Referred Out - Fluids Tests - Urea",{"$f":"'Workload Data Entry'!D308","v":0}]
[null,null,null,null,null,null,"Workload-Individual-RefOutTests-Q2-4-19","Tests Referred Out - Fluids Tests - Xanthochromia (spectrophotometric)",{"$f":"'Workload Data Entry'!D309","v":0}]
[null,null,null,null,null,null,"Workload-Individual-RefOutTests-Q2-4-20","Tests Referred Out - Fluids Tests - Total Fluids",{"$f":"'Workload Data Entry'!D310","v":0}]
[null,null,null,null,null,null,"Workload-Individual-RefOutTests-Q2-5-1","Tests Referred Out - Immunochemistry Tests - C1 Inhibitor antigenic assay",{"$f":"'Workload Data Entry'!D313","v":0}]
[null,null,null,null,null,null,"Workload-Individual-RefOutTests-Q2-5-2","Tests Referred Out - Immunochemistry Tests - C1 Inhibitor autoantibodies ",{"$f":"'Workload Data Entry'!D314","v":0}]
[null,null,null,null,null,null,"Workload-Individual-RefOutTests-Q2-5-3","Tests Referred Out - Immunochemistry Tests - C1 Inhibitor functional assay",{"$f":"'Workload Data Entry'!D315","v":0}]
[null,null,null,null,null,null,"Workload-Individual-RefOutTests-Q2-5-4","Tests Referred Out - Immunochemistry Tests - C1q autoantibody",{"$f":"'Workload Data Entry'!D316","v":0}]
[null,null,null,null,null,null,"Workload-Individual-RefOutTests-Q2-5-5","Tests Referred Out - Immunochemistry Tests - C3 quantitation",{"$f":"'Workload Data Entry'!D317","v":0}]
[null,null,null,null,null,null,"Workload-Individual-RefOutTests-Q2-5-6","Tests Referred Out - Immunochemistry Tests - C3d evaluations",{"$f":"'Workload Data Entry'!D318","v":0}]
[null,null,null,null,null,null,"Workload-Individual-RefOutTests-Q2-5-7","Tests Referred Out - Immunochemistry Tests - C4 quantitation",{"$f":"'Workload Data Entry'!D319","v":0}]
[null,null,null,null,null,null,"Workload-Individual-RefOutTests-Q2-5-8","Tests Referred Out - Immunochemistry Tests - CH50 or 100/AltCH50 or 100 ",{"$f":"'Workload Data Entry'!D320","v":0}]
[null,null,null,null,null,null,"Workload-Individual-RefOutTests-Q2-5-9","Tests Referred Out - Immunochemistry Tests - Complement activation e.g. for C3a C5a etc.",{"$f":"'Workload Data Entry'!D321","v":0}]
[null,null,null,null,null,null,"Workload-Individual-RefOutTests-Q2-5-10","Tests Referred Out - Immunochemistry Tests - Complement component e.g. C2, C8 etc",{"$f":"'Workload Data Entry'!D322","v":0}]
[null,null,null,null,null,null,"Workload-Individual-RefOutTests-Q2-5-11","Tests Referred Out - Immunochemistry Tests - Cryofibrinogen studies",{"$f":"'Workload Data Entry'!D323","v":0}]
[null,null,null,null,null,null,"Workload-Individual-RefOutTests-Q2-5-12","Tests Referred Out - Immunochemistry Tests - Cryoglobulin screen",{"$f":"'Workload Data Entry'!D324","v":0}]
[null,null,null,null,null,null,"Workload-Individual-RefOutTests-Q2-5-13","Tests Referred Out - Immunochemistry Tests - Cryoglobulin typing",{"$f":"'Workload Data Entry'!D325","v":0}]
[null,null,null,null,null,null,"Workload-Individual-RefOutTests-Q2-5-14","Tests Referred Out - Immunochemistry Tests - CSF Oligoclonal Bands",{"$f":"'Workload Data Entry'!D326","v":0}]
[null,null,null,null,null,null,"Workload-Individual-RefOutTests-Q2-5-15","Tests Referred Out - Immunochemistry Tests - Cytokine Levels",{"$f":"'Workload Data Entry'!D327","v":0}]
[null,null,null,null,null,null,"Workload-Individual-RefOutTests-Q2-5-16","Tests Referred Out - Immunochemistry Tests - IgA",{"$f":"'Workload Data Entry'!D328","v":0}]
[null,null,null,null,null,null,"Workload-Individual-RefOutTests-Q2-5-17","Tests Referred Out - Immunochemistry Tests - IgD",{"$f":"'Workload Data Entry'!D329","v":0}]
[null,null,null,null,null,null,"Workload-Individual-RefOutTests-Q2-5-18","Tests Referred Out - Immunochemistry Tests - IgG",{"$f":"'Workload Data Entry'!D330","v":0}]
[null,null,null,null,null,null,"Workload-Individual-RefOutTests-Q2-5-19","Tests Referred Out - Immunochemistry Tests - IgG subclasses (G1, 2, 3 and 4)",{"$f":"'Workload Data Entry'!D331","v":0}]
[null,null,null,null,null,null,"Workload-Individual-RefOutTests-Q2-5-20","Tests Referred Out - Immunochemistry Tests - IgM",{"$f":"'Workload Data Entry'!D332","v":0}]
[null,null,null,null,null,null,"Workload-Individual-RefOutTests-Q2-5-21","Tests Referred Out - Immunochemistry Tests - Mannose binding lectin",{"$f":"'Workload Data Entry'!D333","v":0}]
[null,null,null,null,null,null,"Workload-Individual-RefOutTests-Q2-5-22","Tests Referred Out - Immunochemistry Tests - Protein electrophoresis",{"$f":"'Workload Data Entry'!D334","v":0}]
[null,null,null,null,null,null,"Workload-Individual-RefOutTests-Q2-5-23","Tests Referred Out - Immunochemistry Tests - Serum free light chains",{"$f":"'Workload Data Entry'!D335","v":0}]
[null,null,null,null,null,null,"Workload-Individual-RefOutTests-Q2-5-24","Tests Referred Out - Immunochemistry Tests - Serum paraprotein quantitation",{"$f":"'Workload Data Entry'!D336","v":0}]
[null,null,null,null,null,null,"Workload-Individual-RefOutTests-Q2-5-25","Tests Referred Out - Immunochemistry Tests - Serum paraprotein immunotyping",{"$f":"'Workload Data Entry'!D337","v":0}]
[null,null,null,null,null,null,"Workload-Individual-RefOutTests-Q2-5-26","Tests Referred Out - Immunochemistry Tests - Serum paraprotein immunofixation",{"$f":"'Workload Data Entry'!D338","v":0}]
[null,null,null,null,null,null,"Workload-Individual-RefOutTests-Q2-5-27","Tests Referred Out - Immunochemistry Tests - Urine electrophoresis",{"$f":"'Workload Data Entry'!D339","v":0}]
[null,null,null,null,null,null,"Workload-Individual-RefOutTests-Q2-5-28","Tests Referred Out - Immunochemistry Tests - Urine immunofixation",{"$f":"'Workload Data Entry'!D340","v":0}]
[null,null,null,null,null,null,"Workload-Individual-RefOutTests-Q2-5-29","Tests Referred Out - Immunochemistry Tests - VEGF",{"$f":"'Workload Data Entry'!D341","v":0}]
[null,null,null,null,null,null,"Workload-Individual-RefOutTests-Q2-5-30","Tests Referred Out - Immunochemistry Tests - Total Immunochemistry Tests",{"$f":"'Workload Data Entry'!D342","v":0}]
[null,null,null,null,null,null,"Workload-Individual-RefOutTests-Q2-6-1","Tests Referred Out - Other Chemistry Tests - Bloodspot 17-OHProgesterone",{"$f":"'Workload Data Entry'!D345","v":0}]
[null,null,null,null,null,null,"Workload-Individual-RefOutTests-Q2-6-2","Tests Referred Out - Other Chemistry Tests - Faecal Calprotectin",{"$f":"'Workload Data Entry'!D346","v":0}]
[null,null,null,null,null,null,"Workload-Individual-RefOutTests-Q2-6-3","Tests Referred Out - Other Chemistry Tests - Faecal chromatography",{"$f":"'Workload Data Entry'!D347","v":0}]
[null,null,null,null,null,null,"Workload-Individual-RefOutTests-Q2-6-4","Tests Referred Out - Other Chemistry Tests - Faecal Elastase",{"$f":"'Workload Data Entry'!D348","v":0}]
[null,null,null,null,null,null,"Workload-Individual-RefOutTests-Q2-6-5","Tests Referred Out - Other Chemistry Tests - Faecal Fat",{"$f":"'Workload Data Entry'!D349","v":0}]
[null,null,null,null,null,null,"Workload-Individual-RefOutTests-Q2-6-6","Tests Referred Out - Other Chemistry Tests - Faecal Immunochemical Tests (FIT)",{"$f":"'Workload Data Entry'!D350","v":0}]
[null,null,null,null,null,null,"Workload-Individual-RefOutTests-Q2-6-7","Tests Referred Out - Other Chemistry Tests - Faecal Occult Blood (non-immuno)",{"$f":"'Workload Data Entry'!D351","v":0}]
[null,null,null,null,null,null,"Workload-Individual-RefOutTests-Q2-6-8","Tests Referred Out - Other Chemistry Tests - Faecal Ph",{"$f":"'Workload Data Entry'!D352","v":0}]
[null,null,null,null,null,null,"Workload-Individual-RefOutTests-Q2-6-9","Tests Referred Out - Other Chemistry Tests - Faecal reducing substances",{"$f":"'Workload Data Entry'!D353","v":0}]
[null,null,null,null,null,null,"Workload-Individual-RefOutTests-Q2-6-10","Tests Referred Out - Other Chemistry Tests - Faecal Total Porphyrins",{"$f":"'Workload Data Entry'!D354","v":0}]
[null,null,null,null,null,null,"Workload-Individual-RefOutTests-Q2-6-11","Tests Referred Out - Other Chemistry Tests - Faecal Weight",{"$f":"'Workload Data Entry'!D355","v":0}]
[null,null,null,null,null,null,"Workload-Individual-RefOutTests-Q2-6-12","Tests Referred Out - Other Chemistry Tests - Immuno-reactive trypsin",{"$f":"'Workload Data Entry'!D356","v":0}]
[null,null,null,null,null,null,"Workload-Individual-RefOutTests-Q2-6-13","Tests Referred Out - Other Chemistry Tests - Liver Iron",{"$f":"'Workload Data Entry'!D357","v":0}]
[null,null,null,null,null,null,"Workload-Individual-RefOutTests-Q2-6-14","Tests Referred Out - Other Chemistry Tests - Renal Calculus",{"$f":"'Workload Data Entry'!D358","v":0}]
[null,null,null,null,null,null,"Workload-Individual-RefOutTests-Q2-6-15","Tests Referred Out - Other Chemistry Tests - Urea Breath Test",{"$f":"'Workload Data Entry'!D359","v":0}]
[null,null,null,null,null,null,"Workload-Individual-RefOutTests-Q2-6-16","Tests Referred Out - Other Chemistry Tests - Total Other Chemistry Tests",{"$f":"'Workload Data Entry'!D360","v":0}]
[null,null,null,null,null,null,"Workload-Individual-RefOutTests-Q2-7-1","Tests Referred Out - Autoimmune Serology Tests - 68kD inner ear protein antibodies",{"$f":"'Workload Data Entry'!D364","v":0}]
[null,null,null,null,null,null,"Workload-Individual-RefOutTests-Q2-7-2","Tests Referred Out - Autoimmune Serology Tests - Acetyl choline receptor antibodies",{"$f":"'Workload Data Entry'!D365","v":0}]
[null,null,null,null,null,null,"Workload-Individual-RefOutTests-Q2-7-3","Tests Referred Out - Autoimmune Serology Tests - Adrenal antibodies",{"$f":"'Workload Data Entry'!D366","v":0}]
[null,null,null,null,null,null,"Workload-Individual-RefOutTests-Q2-7-4","Tests Referred Out - Autoimmune Serology Tests - AMPA 1 & 2 antibodies",{"$f":"'Workload Data Entry'!D367","v":0}]
[null,null,null,null,null,null,"Workload-Individual-RefOutTests-Q2-7-5","Tests Referred Out - Autoimmune Serology Tests - ANA screen on Hep2/Hep2000",{"$f":"'Workload Data Entry'!D368","v":0}]
[null,null,null,null,null,null,"Workload-Individual-RefOutTests-Q2-7-6","Tests Referred Out - Autoimmune Serology Tests - ANA screen on other substrate",{"$f":"'Workload Data Entry'!D369","v":0}]
[null,null,null,null,null,null,"Workload-Individual-RefOutTests-Q2-7-7","Tests Referred Out - Autoimmune Serology Tests - ANA titre on Hep2/Hep2000/other substrate (one test per sample NOT each dilution)",{"$f":"'Workload Data Entry'!D370","v":0}]
[null,null,null,null,null,null,"Workload-Individual-RefOutTests-Q2-7-8","Tests Referred Out - Autoimmune Serology Tests - ANCA  - immunoassay for PR3 antibodies = 1 test",{"$f":"'Workload Data Entry'!D371","v":0}]
[null,null,null,null,null,null,"Workload-Individual-RefOutTests-Q2-7-9","Tests Referred Out - Autoimmune Serology Tests - ANCA - immunoassay for MPO antbodies = 1 test",{"$f":"'Workload Data Entry'!D372","v":0}]
[null,null,null,null,null,null,"Workload-Individual-RefOutTests-Q2-7-10","Tests Referred Out - Autoimmune Serology Tests - ANCA by indirect immunofluorescence = 1 test",{"$f":"'Workload Data Entry'!D373","v":0}]
[null,null,null,null,null,null,"Workload-Individual-RefOutTests-Q2-7-11","Tests Referred Out - Autoimmune Serology Tests - Aquaporin 4 antibodies",{"$f":"'Workload Data Entry'!D374","v":0}]
[null,null,null,null,null,null,"Workload-Individual-RefOutTests-Q2-7-12","Tests Referred Out - Autoimmune Serology Tests - Basal ganglia antibodies",{"$f":"'Workload Data Entry'!D375","v":0}]
[null,null,null,null,null,null,"Workload-Individual-RefOutTests-Q2-7-13","Tests Referred Out - Autoimmune Serology Tests - Beta-2 glycoprotein 1 antibodies (IgG)",{"$f":"'Workload Data Entry'!D376","v":0}]
[null,null,null,null,null,null,"Workload-Individual-RefOutTests-Q2-7-14","Tests Referred Out - Autoimmune Serology Tests - Beta-2 glycoprotein 1 antibodies (IgM)",{"$f":"'Workload Data Entry'!D377","v":0}]
[null,null,null,null,null,null,"Workload-Individual-RefOutTests-Q2-7-15","Tests Referred Out - Autoimmune Serology Tests - Biological antibodies (e.g. infliximab antibodies)",{"$f":"'Workload Data Entry'!D378","v":0}]
[null,null,null,null,null,null,"Workload-Individual-RefOutTests-Q2-7-16","Tests Referred Out - Autoimmune Serology Tests - Biological levels (e.g. infliximab levels)",{"$f":"'Workload Data Entry'!D379","v":0}]
[null,null,null,null,null,null,"Workload-Individual-RefOutTests-Q2-7-17","Tests Referred Out - Autoimmune Serology Tests - C1q antibodies",{"$f":"'Workload Data Entry'!D380","v":0}]
[null,null,null,null,null,null,"Workload-Individual-RefOutTests-Q2-7-18","Tests Referred Out - Autoimmune Serology Tests - C3 nephritic factor",{"$f":"'Workload Data Entry'!D381","v":0}]
[null,null,null,null,null,null,"Workload-Individual-RefOutTests-Q2-7-19","Tests Referred Out - Autoimmune Serology Tests - Cardiac muscle antibodies",{"$f":"'Workload Data Entry'!D382","v":0}]
[null,null,null,null,null,null,"Workload-Individual-RefOutTests-Q2-7-20","Tests Referred Out - Autoimmune Serology Tests - Cardiolipin antibodies (IgG)",{"$f":"'Workload Data Entry'!D383","v":0}]
[null,null,null,null,null,null,"Workload-Individual-RefOutTests-Q2-7-21","Tests Referred Out - Autoimmune Serology Tests - Cardiolipin antibodies (IgM)",{"$f":"'Workload Data Entry'!D384","v":0}]
[null,null,null,null,null,null,"Workload-Individual-RefOutTests-Q2-7-22","Tests Referred Out - Autoimmune Serology Tests - CASPR2 antibodies",{"$f":"'Workload Data Entry'!D385","v":0}]
[null,null,null,null,null,null,"Workload-Individual-RefOutTests-Q2-7-23","Tests Referred Out - Autoimmune Serology Tests - Centromere B (CENPB) antibodies - by immunoassay/blot not IIF",{"$f":"'Workload Data Entry'!D386","v":0}]
[null,null,null,null,null,null,"Workload-Individual-RefOutTests-Q2-7-24","Tests Referred Out - Autoimmune Serology Tests - Connective tissue disease (CTD) screen (one test per sample)",{"$f":"'Workload Data Entry'!D387","v":0}]
[null,null,null,null,null,null,"Workload-Individual-RefOutTests-Q2-7-25","Tests Referred Out - Autoimmune Serology Tests - Cyclic citrullinated proteins (CCP) antibodies",{"$f":"'Workload Data Entry'!D388","v":0}]
[null,null,null,null,null,null,"Workload-Individual-RefOutTests-Q2-7-26","Tests Referred Out - Autoimmune Serology Tests - Deamidated-gliadin antibodies",{"$f":"'Workload Data Entry'!D389","v":0}]
[null,null,null,null,null,null,"Workload-Individual-RefOutTests-Q2-7-27","Tests Referred Out - Autoimmune Serology Tests - DNA antibodies by immunoassay/ELISA",{"$f":"'Workload Data Entry'!D390","v":0}]
[null,null,null,null,null,null,"Workload-Individual-RefOutTests-Q2-7-28","Tests Referred Out - Autoimmune Serology Tests - DNA antibodies by indirect immunofluoresence (Crithidia)",{"$f":"'Workload Data Entry'!D391","v":0}]
[null,null,null,null,null,null,"Workload-Individual-RefOutTests-Q2-7-29","Tests Referred Out - Autoimmune Serology Tests - ENA screen (1 test per sample)",{"$f":"'Workload Data Entry'!D392","v":0}]
[null,null,null,null,null,null,"Workload-Individual-RefOutTests-Q2-7-30","Tests Referred Out - Autoimmune Serology Tests - Endomysial (IgA) antibodies",{"$f":"'Workload Data Entry'!D393","v":0}]
[null,null,null,null,null,null,"Workload-Individual-RefOutTests-Q2-7-31","Tests Referred Out - Autoimmune Serology Tests - Endomysial (IgG) antibodies",{"$f":"'Workload Data Entry'!D394","v":0}]
[null,null,null,null,null,null,"Workload-Individual-RefOutTests-Q2-7-32","Tests Referred Out - Autoimmune Serology Tests - Fibrallin antibodies",{"$f":"'Workload Data Entry'!D395","v":0}]
[null,null,null,null,null,null,"Workload-Individual-RefOutTests-Q2-7-33","Tests Referred Out - Autoimmune Serology Tests - GABA antibodies",{"$f":"'Workload Data Entry'!D396","v":0}]
[null,null,null,null,null,null,"Workload-Individual-RefOutTests-Q2-7-34","Tests Referred Out - Autoimmune Serology Tests - Ganglionic acetyl receptor antibodies",{"$f":"'Workload Data Entry'!D397","v":0}]
[null,null,null,null,null,null,"Workload-Individual-RefOutTests-Q2-7-35","Tests Referred Out - Autoimmune Serology Tests - Glomerular basement membrane (GBM) antibodies",{"$f":"'Workload Data Entry'!D398","v":0}]
[null,null,null,null,null,null,"Workload-Individual-RefOutTests-Q2-7-36","Tests Referred Out - Autoimmune Serology Tests - Glutamic acid decarboxylase (GAD) antibodies",{"$f":"'Workload Data Entry'!D399","v":0}]
[null,null,null,null,null,null,"Workload-Individual-RefOutTests-Q2-7-37","Tests Referred Out - Autoimmune Serology Tests - Glycine receptor antibodies",{"$f":"'Workload Data Entry'!D400","v":0}]
[null,null,null,null,null,null,"Workload-Individual-RefOutTests-Q2-7-38","Tests Referred Out - Autoimmune Serology Tests - Ganglioside antibodies",{"$f":"'Workload Data Entry'!D401","v":0}]
[null,null,null,null,null,null,"Workload-Individual-RefOutTests-Q2-7-39","Tests Referred Out - Autoimmune Serology Tests - Myelin associated glycoprotein (MAG) antibodies",{"$f":"'Workload Data Entry'!D402","v":0}]
[null,null,null,null,null,null,"Workload-Individual-RefOutTests-Q2-7-40","Tests Referred Out - Autoimmune Serology Tests - Beta interferon neutralising antibodies",{"$f":"'Workload Data Entry'!D403","v":0}]
[null,null,null,null,null,null,"Workload-Individual-RefOutTests-Q2-7-41","Tests Referred Out - Autoimmune Serology Tests - Granulocyte antibodies",{"$f":"'Workload Data Entry'!D404","v":0}]
[null,null,null,null,null,null,"Workload-Individual-RefOutTests-Q2-7-42","Tests Referred Out - Autoimmune Serology Tests - Histone antibodies",{"$f":"'Workload Data Entry'!D405","v":0}]
[null,null,null,null,null,null,"Workload-Individual-RefOutTests-Q2-7-43","Tests Referred Out - Autoimmune Serology Tests - HMCoA antibodies",{"$f":"'Workload Data Entry'!D406","v":0}]
[null,null,null,null,null,null,"Workload-Individual-RefOutTests-Q2-7-44","Tests Referred Out - Autoimmune Serology Tests - IA-2 antibodies",{"$f":"'Workload Data Entry'!D407","v":0}]
[null,null,null,null,null,null,"Workload-Individual-RefOutTests-Q2-7-45","Tests Referred Out - Autoimmune Serology Tests - ZnT8 antibodies",{"$f":"'Workload Data Entry'!D408","v":0}]
[null,null,null,null,null,null,"Workload-Individual-RefOutTests-Q2-7-46","Tests Referred Out - Autoimmune Serology Tests - Insulin antibodies",{"$f":"'Workload Data Entry'!D409","v":0}]
[null,null,null,null,null,null,"Workload-Individual-RefOutTests-Q2-7-47","Tests Referred Out - Autoimmune Serology Tests - Intrinsic factor antibodies",{"$f":"'Workload Data Entry'!D410","v":0}]
[null,null,null,null,null,null,"Workload-Individual-RefOutTests-Q2-7-48","Tests Referred Out - Autoimmune Serology Tests - Islet cell antibodies",{"$f":"'Workload Data Entry'!D411","v":0}]
[null,null,null,null,null,null,"Workload-Individual-RefOutTests-Q2-7-49","Tests Referred Out - Autoimmune Serology Tests - Jo-1 antibodies",{"$f":"'Workload Data Entry'!D412","v":0}]
[null,null,null,null,null,null,"Workload-Individual-RefOutTests-Q2-7-50","Tests Referred Out - Autoimmune Serology Tests - La antibodies",{"$f":"'Workload Data Entry'!D413","v":0}]
[null,null,null,null,null,null,"Workload-Individual-RefOutTests-Q2-7-51","Tests Referred Out - Autoimmune Serology Tests - LGIR1 antibodies",{"$f":"'Workload Data Entry'!D414","v":0}]
[null,null,null,null,null,null,"Workload-Individual-RefOutTests-Q2-7-52","Tests Referred Out - Autoimmune Serology Tests - Lig1 antibodies",{"$f":"'Workload Data Entry'!D415","v":0}]
[null,null,null,null,null,null,"Workload-Individual-RefOutTests-Q2-7-53","Tests Referred Out - Autoimmune Serology Tests - Liver & gastric parietal cell antibodies by indirect immunofluorescence",{"$f":"'Workload Data Entry'!D416","v":0}]
[null,null,null,null,null,null,"Workload-Individual-RefOutTests-Q2-7-54","Tests Referred Out - Autoimmune Serology Tests - Liver antibodies by immunoblot (1 test per sample)",{"$f":"'Workload Data Entry'!D417","v":0}]
[null,null,null,null,null,null,"Workload-Individual-RefOutTests-Q2-7-55","Tests Referred Out - Autoimmune Serology Tests - Liver antibody titrations (one test per sample NOT each dilution)",{"$f":"'Workload Data Entry'!D418","v":0}]
[null,null,null,null,null,null,"Workload-Individual-RefOutTests-Q2-7-56","Tests Referred Out - Autoimmune Serology Tests - Mi-2 antibodies",{"$f":"'Workload Data Entry'!D419","v":0}]
[null,null,null,null,null,null,"Workload-Individual-RefOutTests-Q2-7-57","Tests Referred Out - Autoimmune Serology Tests - MOGL antibodies",{"$f":"'Workload Data Entry'!D420","v":0}]
[null,null,null,null,null,null,"Workload-Individual-RefOutTests-Q2-7-58","Tests Referred Out - Autoimmune Serology Tests - Muscle specific kinase (MUSK) antibodies",{"$f":"'Workload Data Entry'!D421","v":0}]
[null,null,null,null,null,null,"Workload-Individual-RefOutTests-Q2-7-59","Tests Referred Out - Autoimmune Serology Tests - Myositis antibody panel by immunoblot (1 test per sample)",{"$f":"'Workload Data Entry'!D422","v":0}]
[null,null,null,null,null,null,"Workload-Individual-RefOutTests-Q2-7-60","Tests Referred Out - Autoimmune Serology Tests - Neuronal antibodies by indirect immunofluorescence",{"$f":"'Workload Data Entry'!D423","v":0}]
[null,null,null,null,null,null,"Workload-Individual-RefOutTests-Q2-7-61","Tests Referred Out - Autoimmune Serology Tests - Neuronal antibodies by immunoblot (1 test per sample)",{"$f":"'Workload Data Entry'!D424","v":0}]
[null,null,null,null,null,null,"Workload-Individual-RefOutTests-Q2-7-62","Tests Referred Out - Autoimmune Serology Tests - NMDA receptor antibodies",{"$f":"'Workload Data Entry'!D425","v":0}]
[null,null,null,null,null,null,"Workload-Individual-RefOutTests-Q2-7-63","Tests Referred Out - Autoimmune Serology Tests - Other anti-phospholipid antibodies",{"$f":"'Workload Data Entry'!D426","v":0}]
[null,null,null,null,null,null,"Workload-Individual-RefOutTests-Q2-7-64","Tests Referred Out - Autoimmune Serology Tests - Other autoantibodies by indirect fluorescence",{"$f":"'Workload Data Entry'!D427","v":0}]
[null,null,null,null,null,null,"Workload-Individual-RefOutTests-Q2-7-65","Tests Referred Out - Autoimmune Serology Tests - Parathyroid antibodies",{"$f":"'Workload Data Entry'!D428","v":0}]
[null,null,null,null,null,null,"Workload-Individual-RefOutTests-Q2-7-66","Tests Referred Out - Autoimmune Serology Tests - PCNA antibodies",{"$f":"'Workload Data Entry'!D429","v":0}]
[null,null,null,null,null,null,"Workload-Individual-RefOutTests-Q2-7-67","Tests Referred Out - Autoimmune Serology Tests - Phospholipase A2 (PLA2) receptor antibodies",{"$f":"'Workload Data Entry'!D430","v":0}]
[null,null,null,null,null,null,"Workload-Individual-RefOutTests-Q2-7-68","Tests Referred Out - Autoimmune Serology Tests - Pyruvate dehydrogenase (M2) antibodies",{"$f":"'Workload Data Entry'!D431","v":0}]
[null,null,null,null,null,null,"Workload-Individual-RefOutTests-Q2-7-69","Tests Referred Out - Autoimmune Serology Tests - Rheumatoid factor by latex agglutination",{"$f":"'Workload Data Entry'!D432","v":0}]
[null,null,null,null,null,null,"Workload-Individual-RefOutTests-Q2-7-70","Tests Referred Out - Autoimmune Serology Tests - Rheumatoid factor by quantitative assay",{"$f":"'Workload Data Entry'!D433","v":0}]
[null,null,null,null,null,null,"Workload-Individual-RefOutTests-Q2-7-71","Tests Referred Out - Autoimmune Serology Tests - Rheumatoid factor - follow up test",{"$f":"'Workload Data Entry'!D434","v":0}]
[null,null,null,null,null,null,"Workload-Individual-RefOutTests-Q2-7-72","Tests Referred Out - Autoimmune Serology Tests - Ribosomal P antibodies",{"$f":"'Workload Data Entry'!D435","v":0}]
[null,null,null,null,null,null,"Workload-Individual-RefOutTests-Q2-7-73","Tests Referred Out - Autoimmune Serology Tests - RNA polymerase III antibodies",{"$f":"'Workload Data Entry'!D436","v":0}]
[null,null,null,null,null,null,"Workload-Individual-RefOutTests-Q2-7-74","Tests Referred Out - Autoimmune Serology Tests - Ro52 antibodies",{"$f":"'Workload Data Entry'!D437","v":0}]
[null,null,null,null,null,null,"Workload-Individual-RefOutTests-Q2-7-75","Tests Referred Out - Autoimmune Serology Tests - Ro60 antibodies",{"$f":"'Workload Data Entry'!D438","v":0}]
[null,null,null,null,null,null,"Workload-Individual-RefOutTests-Q2-7-76","Tests Referred Out - Autoimmune Serology Tests - Scl70 antibodies",{"$f":"'Workload Data Entry'!D439","v":0}]
[null,null,null,null,null,null,"Workload-Individual-RefOutTests-Q2-7-77","Tests Referred Out - Autoimmune Serology Tests - Skeletal muscle antibodies",{"$f":"'Workload Data Entry'!D440","v":0}]
[null,null,null,null,null,null,"Workload-Individual-RefOutTests-Q2-7-78","Tests Referred Out - Autoimmune Serology Tests - Skin abs (ELISA e.g. DSG1/3, BP180/230)",{"$f":"'Workload Data Entry'!D441","v":0}]
[null,null,null,null,null,null,"Workload-Individual-RefOutTests-Q2-7-79","Tests Referred Out - Autoimmune Serology Tests - Skin antibodies (e.g. Pemphigus/goid) by indirect immunofluorescence",{"$f":"'Workload Data Entry'!D442","v":0}]
[null,null,null,null,null,null,"Workload-Individual-RefOutTests-Q2-7-80","Tests Referred Out - Autoimmune Serology Tests - Sm antibodies",{"$f":"'Workload Data Entry'!D443","v":0}]
[null,null,null,null,null,null,"Workload-Individual-RefOutTests-Q2-7-81","Tests Referred Out - Autoimmune Serology Tests - Steroid cell antibodies (Ovary/testes/adrenal antibodies)",{"$f":"'Workload Data Entry'!D444","v":0}]
[null,null,null,null,null,null,"Workload-Individual-RefOutTests-Q2-7-82","Tests Referred Out - Autoimmune Serology Tests - Submaxillary gland antibodies",{"$f":"'Workload Data Entry'!D445","v":0}]
[null,null,null,null,null,null,"Workload-Individual-RefOutTests-Q2-7-83","Tests Referred Out - Autoimmune Serology Tests - Thyroglobulin antibodies",{"$f":"'Workload Data Entry'!D446","v":0}]
[null,null,null,null,null,null,"Workload-Individual-RefOutTests-Q2-7-84","Tests Referred Out - Autoimmune Serology Tests - Thyroid peroxidase antobodies",{"$f":"'Workload Data Entry'!D447","v":0}]
[null,null,null,null,null,null,"Workload-Individual-RefOutTests-Q2-7-85","Tests Referred Out - Autoimmune Serology Tests - Tissue transglutaminase antibodies (IgA)",{"$f":"'Workload Data Entry'!D448","v":0}]
[null,null,null,null,null,null,"Workload-Individual-RefOutTests-Q2-7-86","Tests Referred Out - Autoimmune Serology Tests - Tissue transglutaminase antibodies (IgG)",{"$f":"'Workload Data Entry'!D449","v":0}]
[null,null,null,null,null,null,"Workload-Individual-RefOutTests-Q2-7-87","Tests Referred Out - Autoimmune Serology Tests - TSH receptor antibodies   ",{"$f":"'Workload Data Entry'!D450","v":0}]
[null,null,null,null,null,null,"Workload-Individual-RefOutTests-Q2-7-88","Tests Referred Out - Autoimmune Serology Tests - U1 RNP / 70kDa RNP antibodies",{"$f":"'Workload Data Entry'!D451","v":0}]
[null,null,null,null,null,null,"Workload-Individual-RefOutTests-Q2-7-89","Tests Referred Out - Autoimmune Serology Tests - Voltage gated calcium channel (VGCC) antibodies",{"$f":"'Workload Data Entry'!D452","v":0}]
[null,null,null,null,null,null,"Workload-Individual-RefOutTests-Q2-7-90","Tests Referred Out - Autoimmune Serology Tests - Voltage gated potassium channel (VGKC) antibodies",{"$f":"'Workload Data Entry'!D453","v":0}]
[null,null,null,null,null,null,"Workload-Individual-RefOutTests-Q2-7-91","Tests Referred Out - Autoimmune Serology Tests - Total Autoimmune Serology",{"$f":"'Workload Data Entry'!D454","v":0}]
[null,null,null,null,null,null,"Workload-Individual-RefOutTests-Q2-8-1","Tests Referred Out - Allergy Tests - Allergen Components Specific IgE",{"$f":"'Workload Data Entry'!D457","v":0}]
[null,null,null,null,null,null,"Workload-Individual-RefOutTests-Q2-8-2","Tests Referred Out - Allergy Tests - Allergen Specific IgE",{"$f":"'Workload Data Entry'!D458","v":0}]
[null,null,null,null,null,null,"Workload-Individual-RefOutTests-Q2-8-3","Tests Referred Out - Allergy Tests - IgE Total level",{"$f":"'Workload Data Entry'!D459","v":0}]
[null,null,null,null,null,null,"Workload-Individual-RefOutTests-Q2-8-4","Tests Referred Out - Allergy Tests - IgG precipitins (Aspergillus, Avian etc…)",{"$f":"'Workload Data Entry'!D460","v":0}]
[null,null,null,null,null,null,"Workload-Individual-RefOutTests-Q2-8-5","Tests Referred Out - Allergy Tests - ISAC Test",{"$f":"'Workload Data Entry'!D461","v":0}]
[null,null,null,null,null,null,"Workload-Individual-RefOutTests-Q2-8-6","Tests Referred Out - Allergy Tests - Tryptase",{"$f":"'Workload Data Entry'!D462","v":0}]
[null,null,null,null,null,null,"Workload-Individual-RefOutTests-Q2-8-7","Tests Referred Out - Allergy Tests - Total Allergy Tests",{"$f":"'Workload Data Entry'!D463","v":0}]
[null,null,null,null,null,null,"Workload-Individual-RefOutTests-Q2-9-1","Tests Referred Out - Microbial Serology for Immunocompetence Testing - Meningococcal antibody (MCA)",{"$f":"'Workload Data Entry'!D466","v":0}]
[null,null,null,null,null,null,"Workload-Individual-RefOutTests-Q2-9-2","Tests Referred Out - Microbial Serology for Immunocompetence Testing - Diphtheria antibody",{"$f":"'Workload Data Entry'!D467","v":0}]
[null,null,null,null,null,null,"Workload-Individual-RefOutTests-Q2-9-3","Tests Referred Out - Microbial Serology for Immunocompetence Testing - Haemophilus influenzae b antibody",{"$f":"'Workload Data Entry'!D468","v":0}]
[null,null,null,null,null,null,"Workload-Individual-RefOutTests-Q2-9-4","Tests Referred Out - Microbial Serology for Immunocompetence Testing - Pneumococcal antibody",{"$f":"'Workload Data Entry'!D469","v":0}]
[null,null,null,null,null,null,"Workload-Individual-RefOutTests-Q2-9-5","Tests Referred Out - Microbial Serology for Immunocompetence Testing - Pneumococcal serotype specific antibody response (PSSA)",{"$f":"'Workload Data Entry'!D470","v":0}]
[null,null,null,null,null,null,"Workload-Individual-RefOutTests-Q2-9-6","Tests Referred Out - Microbial Serology for Immunocompetence Testing - Tetanus antibody",{"$f":"'Workload Data Entry'!D471","v":0}]
[null,null,null,null,null,null,"Workload-Individual-RefOutTests-Q2-9-7","Tests Referred Out - Microbial Serology for Immunocompetence Testing - Total Microbial Serology for Immunocompetence Testing",{"$f":"'Workload Data Entry'!D472","v":0}]
[null,null,null,null,null,null,"Workload-Individual-RefOutTests-Q2-10-1","Tests Referred Out - Cellular Immunology - B-cell phenotyping for common variable immunodeficiency (IgD/CD27)",{"$f":"'Workload Data Entry'!D475","v":0}]
[null,null,null,null,null,null,"Workload-Individual-RefOutTests-Q2-10-2","Tests Referred Out - Cellular Immunology - Cytokine functional studies",{"$f":"'Workload Data Entry'!D476","v":0}]
[null,null,null,null,null,null,"Workload-Individual-RefOutTests-Q2-10-3","Tests Referred Out - Cellular Immunology - Gamma interferon assays for TB: in-house assay",{"$f":"'Workload Data Entry'!D477","v":0}]
[null,null,null,null,null,null,"Workload-Individual-RefOutTests-Q2-10-4","Tests Referred Out - Cellular Immunology - Gamma interferon assays for TB: quantiferon",{"$f":"'Workload Data Entry'!D478","v":0}]
[null,null,null,null,null,null,"Workload-Individual-RefOutTests-Q2-10-5","Tests Referred Out - Cellular Immunology - Gamma interferon assays for TB: T-spot",{"$f":"'Workload Data Entry'!D479","v":0}]
[null,null,null,null,null,null,"Workload-Individual-RefOutTests-Q2-10-6","Tests Referred Out - Cellular Immunology - Lymphocyte function assays",{"$f":"'Workload Data Entry'!D480","v":0}]
[null,null,null,null,null,null,"Workload-Individual-RefOutTests-Q2-10-7","Tests Referred Out - Cellular Immunology - Specialised functional assays for primary immune deficiency (excluding genetics)",{"$f":"'Workload Data Entry'!D481","v":0}]
[null,null,null,null,null,null,"Workload-Individual-RefOutTests-Q2-10-8","Tests Referred Out - Cellular Immunology - Lymphocyte phenotyping/subset for PRIMARY immunodeficiency",{"$f":"'Workload Data Entry'!D482","v":0}]
[null,null,null,null,null,null,"Workload-Individual-RefOutTests-Q2-10-9","Tests Referred Out - Cellular Immunology - Lymphocyte phenotyping/subsets for HIV",{"$f":"'Workload Data Entry'!D483","v":0}]
[null,null,null,null,null,null,"Workload-Individual-RefOutTests-Q2-10-10","Tests Referred Out - Cellular Immunology - Lymphocyte phenotyping/subsets LEUKAEMIA/LYMPHOMA typing ",{"$f":"'Workload Data Entry'!D484","v":0}]
[null,null,null,null,null,null,"Workload-Individual-RefOutTests-Q2-10-11","Tests Referred Out - Cellular Immunology - Natural killer cell assay",{"$f":"'Workload Data Entry'!D485","v":0}]
[null,null,null,null,null,null,"Workload-Individual-RefOutTests-Q2-10-12","Tests Referred Out - Cellular Immunology - Neutrophil Adhesion Markers",{"$f":"'Workload Data Entry'!D486","v":0}]
[null,null,null,null,null,null,"Workload-Individual-RefOutTests-Q2-10-13","Tests Referred Out - Cellular Immunology - Neutrophil function",{"$f":"'Workload Data Entry'!D487","v":0}]
[null,null,null,null,null,null,"Workload-Individual-RefOutTests-Q2-10-14","Tests Referred Out - Cellular Immunology - Neutrophil respiratory burst by flow cytometry",{"$f":"'Workload Data Entry'!D488","v":0}]
[null,null,null,null,null,null,"Workload-Individual-RefOutTests-Q2-10-15","Tests Referred Out - Cellular Immunology - Neutrophil respiratory burst by NBT slide assay",{"$f":"'Workload Data Entry'!D489","v":0}]
[null,null,null,null,null,null,"Workload-Individual-RefOutTests-Q2-10-16","Tests Referred Out - Cellular Immunology - Total Cellular Immunology",{"$f":"'Workload Data Entry'!D490","v":0}]
[null,null,null,null,null,null,"Workload-Individual-RefOutTests-Q2-11-1","Tests Referred Out - Histocompatibility and Immunogenetics Tests - Crossmatching",{"$f":"'Workload Data Entry'!D493","v":0}]
[null,null,null,null,null,null,"Workload-Individual-RefOutTests-Q2-11-2","Tests Referred Out - Histocompatibility and Immunogenetics Tests - HFE typing",{"$f":"'Workload Data Entry'!D494","v":0}]
[null,null,null,null,null,null,"Workload-Individual-RefOutTests-Q2-11-3","Tests Referred Out - Histocompatibility and Immunogenetics Tests - HLA antibody characterisation",{"$f":"'Workload Data Entry'!D495","v":0}]
[null,null,null,null,null,null,"Workload-Individual-RefOutTests-Q2-11-4","Tests Referred Out - Histocompatibility and Immunogenetics Tests - HLA B27 typing flow cytometry",{"$f":"'Workload Data Entry'!D496","v":0}]
[null,null,null,null,null,null,"Workload-Individual-RefOutTests-Q2-11-5","Tests Referred Out - Histocompatibility and Immunogenetics Tests - HLA B57 ",{"$f":"'Workload Data Entry'!D497","v":0}]
[null,null,null,null,null,null,"Workload-Individual-RefOutTests-Q2-11-6","Tests Referred Out - Histocompatibility and Immunogenetics Tests - HLA Other Disease Association Allele Typing",{"$f":"'Workload Data Entry'!D498","v":0}]
[null,null,null,null,null,null,"Workload-Individual-RefOutTests-Q2-11-7","Tests Referred Out - Histocompatibility and Immunogenetics Tests - HLA class I A & B",{"$f":"'Workload Data Entry'!D499","v":0}]
[null,null,null,null,null,null,"Workload-Individual-RefOutTests-Q2-11-8","Tests Referred Out - Histocompatibility and Immunogenetics Tests - HLA class I Cw",{"$f":"'Workload Data Entry'!D500","v":0}]
[null,null,null,null,null,null,"Workload-Individual-RefOutTests-Q2-11-9","Tests Referred Out - Histocompatibility and Immunogenetics Tests - HLA class II DP",{"$f":"'Workload Data Entry'!D501","v":0}]
[null,null,null,null,null,null,"Workload-Individual-RefOutTests-Q2-11-10","Tests Referred Out - Histocompatibility and Immunogenetics Tests - HLA class II DQ",{"$f":"'Workload Data Entry'!D502","v":0}]
[null,null,null,null,null,null,"Workload-Individual-RefOutTests-Q2-11-11","Tests Referred Out - Histocompatibility and Immunogenetics Tests - HLA class II DR",{"$f":"'Workload Data Entry'!D503","v":0}]
[null,null,null,null,null,null,"Workload-Individual-RefOutTests-Q2-11-12","Tests Referred Out - Histocompatibility and Immunogenetics Tests - Total H&I Tests",{"$f":"'Workload Data Entry'!D504","v":0}]
[null,null,null,null,null,null,"Workload-Individual-RefOutTests-Q2-12-1","Tests Referred Out - Immunohistology - Tests Referred Out for Immunohistology",{"$f":"'Workload Data Entry'!D507","v":0}]
[null,null,null,null,null,null,"Workload-Individual-RefOutTests-Q2-13-1","Tests Referred Out - Routine Haematology - Blood film - no report(1)",{"$f":"'Workload Data Entry'!D511","v":0}]
[null,null,null,null,null,null,"Workload-Individual-RefOutTests-Q2-13-2","Tests Referred Out - Routine Haematology - Blood film - with report(1)",{"$f":"'Workload Data Entry'!D512","v":0}]
[null,null,null,null,null,null,"Workload-Individual-RefOutTests-Q2-13-3","Tests Referred Out - Routine Haematology - ESR",{"$f":"'Workload Data Entry'!D513","v":0}]
[null,null,null,null,null,null,"Workload-Individual-RefOutTests-Q2-13-4","Tests Referred Out - Routine Haematology - FBC",{"$f":"'Workload Data Entry'!D514","v":0}]
[null,null,null,null,null,null,"Workload-Individual-RefOutTests-Q2-13-5","Tests Referred Out - Routine Haematology - Glandular fever screening",{"$f":"'Workload Data Entry'!D515","v":0}]
[null,null,null,null,null,null,"Workload-Individual-RefOutTests-Q2-13-6","Tests Referred Out - Routine Haematology - Malaria parasite film",{"$f":"'Workload Data Entry'!D516","v":0}]
[null,null,null,null,null,null,"Workload-Individual-RefOutTests-Q2-13-7","Tests Referred Out - Routine Haematology - Other Malaria Tests",{"$f":"'Workload Data Entry'!D517","v":0}]
[null,null,null,null,null,null,"Workload-Individual-RefOutTests-Q2-13-8","Tests Referred Out - Routine Haematology - Plasma viscosity",{"$f":"'Workload Data Entry'!D518","v":0}]
[null,null,null,null,null,null,"Workload-Individual-RefOutTests-Q2-13-9","Tests Referred Out - Routine Haematology - Pregnancy test",{"$f":"'Workload Data Entry'!D519","v":0}]
[null,null,null,null,null,null,"Workload-Individual-RefOutTests-Q2-13-10","Tests Referred Out - Routine Haematology - Reticulocytes",{"$f":"'Workload Data Entry'!D520","v":0}]
[null,null,null,null,null,null,"Workload-Individual-RefOutTests-Q2-13-11","Tests Referred Out - Routine Haematology - Semen Analysis: fertility",{"$f":"'Workload Data Entry'!D521","v":0}]
[null,null,null,null,null,null,"Workload-Individual-RefOutTests-Q2-13-12","Tests Referred Out - Routine Haematology - Semen Analysis: post vasectomy",{"$f":"'Workload Data Entry'!D522","v":0}]
[null,null,null,null,null,null,"Workload-Individual-RefOutTests-Q2-13-13","Tests Referred Out - Routine Haematology - Total Routine Haematology",{"$f":"'Workload Data Entry'!D523","v":0}]
[null,null,null,null,null,null,"Workload-Individual-RefOutTests-Q2-14-1","Tests Referred Out - Bone Marrow Investigations - Aspirate",{"$f":"'Workload Data Entry'!D526","v":0}]
[null,null,null,null,null,null,"Workload-Individual-RefOutTests-Q2-14-2","Tests Referred Out - Bone Marrow Investigations - Cytogenetics, eg Not Molecular Diagnostics",{"$f":"'Workload Data Entry'!D527","v":0}]
[null,null,null,null,null,null,"Workload-Individual-RefOutTests-Q2-14-3","Tests Referred Out - Bone Marrow Investigations - Immunocytochemistry",{"$f":"'Workload Data Entry'!D528","v":0}]
[null,null,null,null,null,null,"Workload-Individual-RefOutTests-Q2-14-4","Tests Referred Out - Bone Marrow Investigations - Iron stains(2)",{"$f":"'Workload Data Entry'!D529","v":0}]
[null,null,null,null,null,null,"Workload-Individual-RefOutTests-Q2-14-5","Tests Referred Out - Bone Marrow Investigations - Other cytochemistry",{"$f":"'Workload Data Entry'!D530","v":0}]
[null,null,null,null,null,null,"Workload-Individual-RefOutTests-Q2-14-6","Tests Referred Out - Bone Marrow Investigations - Total Bone Marrow Investigations",{"$f":"'Workload Data Entry'!D531","v":0}]
[null,null,null,null,null,null,"Workload-Individual-RefOutTests-Q2-14-7","Tests Referred Out - Bone Marrow Investigations - Trephine biopsy",{"$f":"'Workload Data Entry'!D532","v":0}]
[null,null,null,null,null,null,"Workload-Individual-RefOutTests-Q2-14-8","Tests Referred Out - Bone Marrow Investigations - Total Bone Marrow Investigations",{"$f":"'Workload Data Entry'!D533","v":0}]
[null,null,null,null,null,null,"Workload-Individual-RefOutTests-Q2-15-1","Tests Referred Out - Coagulation - APC resistance",{"$f":"'Workload Data Entry'!D536","v":0}]
[null,null,null,null,null,null,"Workload-Individual-RefOutTests-Q2-15-2","Tests Referred Out - Coagulation - APTT",{"$f":"'Workload Data Entry'!D537","v":0}]
[null,null,null,null,null,null,"Workload-Individual-RefOutTests-Q2-15-3","Tests Referred Out - Coagulation - AT (Anti Thrombin)",{"$f":"'Workload Data Entry'!D538","v":0}]
[null,null,null,null,null,null,"Workload-Individual-RefOutTests-Q2-15-4","Tests Referred Out - Coagulation - Factor assay",{"$f":"'Workload Data Entry'!D539","v":0}]
[null,null,null,null,null,null,"Workload-Individual-RefOutTests-Q2-15-5","Tests Referred Out - Coagulation - Factor Xa",{"$f":"'Workload Data Entry'!D540","v":0}]
[null,null,null,null,null,null,"Workload-Individual-RefOutTests-Q2-15-6","Tests Referred Out - Coagulation - FDP/D Dimer",{"$f":"'Workload Data Entry'!D541","v":0}]
[null,null,null,null,null,null,"Workload-Individual-RefOutTests-Q2-15-7","Tests Referred Out - Coagulation - Fibrinogen: Clauss etc",{"$f":"'Workload Data Entry'!D542","v":0}]
[null,null,null,null,null,null,"Workload-Individual-RefOutTests-Q2-15-8","Tests Referred Out - Coagulation - Fibrinogen: derived",{"$f":"'Workload Data Entry'!D543","v":0}]
[null,null,null,null,null,null,"Workload-Individual-RefOutTests-Q2-15-9","Tests Referred Out - Coagulation - FV Leiden/Prothrombin G20210A",{"$f":"'Workload Data Entry'!D544","v":0}]
[null,null,null,null,null,null,"Workload-Individual-RefOutTests-Q2-15-10","Tests Referred Out - Coagulation - Inhibitor assay",{"$f":"'Workload Data Entry'!D545","v":0}]
[null,null,null,null,null,null,"Workload-Individual-RefOutTests-Q2-15-11","Tests Referred Out - Coagulation - Inhibitor screens (not lupus)",{"$f":"'Workload Data Entry'!D546","v":0}]
[null,null,null,null,null,null,"Workload-Individual-RefOutTests-Q2-15-12","Tests Referred Out - Coagulation - INR",{"$f":"'Workload Data Entry'!D547","v":0}]
[null,null,null,null,null,null,"Workload-Individual-RefOutTests-Q2-15-13","Tests Referred Out - Coagulation - Lupus Anticoagulant",{"$f":"'Workload Data Entry'!D548","v":0}]
[null,null,null,null,null,null,"Workload-Individual-RefOutTests-Q2-15-14","Tests Referred Out - Coagulation - NOAC Management",{"$f":"'Workload Data Entry'!D549","v":0}]
[null,null,null,null,null,null,"Workload-Individual-RefOutTests-Q2-15-15","Tests Referred Out - Coagulation - Platelet aggregation tests",{"$f":"'Workload Data Entry'!D550","v":0}]
[null,null,null,null,null,null,"Workload-Individual-RefOutTests-Q2-15-16","Tests Referred Out - Coagulation - Protein C",{"$f":"'Workload Data Entry'!D551","v":0}]
[null,null,null,null,null,null,"Workload-Individual-RefOutTests-Q2-15-17","Tests Referred Out - Coagulation - Protein S",{"$f":"'Workload Data Entry'!D552","v":0}]
[null,null,null,null,null,null,"Workload-Individual-RefOutTests-Q2-15-18","Tests Referred Out - Coagulation - PT",{"$f":"'Workload Data Entry'!D553","v":0}]
[null,null,null,null,null,null,"Workload-Individual-RefOutTests-Q2-15-19","Tests Referred Out - Coagulation - Reptilase time",{"$f":"'Workload Data Entry'!D554","v":0}]
[null,null,null,null,null,null,"Workload-Individual-RefOutTests-Q2-15-20","Tests Referred Out - Coagulation - Thrombin time",{"$f":"'Workload Data Entry'!D555","v":0}]
[null,null,null,null,null,null,"Workload-Individual-RefOutTests-Q2-15-21","Tests Referred Out - Coagulation - VWF multimer analysis",{"$f":"'Workload Data Entry'!D556","v":0}]
[null,null,null,null,null,null,"Workload-Individual-RefOutTests-Q2-15-22","Tests Referred Out - Coagulation - Section Subtotal - Coagulation",{"$f":"'Workload Data Entry'!D557","v":0}]
[null,null,null,null,null,null,"Workload-Individual-RefOutTests-Q2-16-1","Tests Referred Out - Haematinic Assays - Erythropoietin",{"$f":"'Workload Data Entry'!D560","v":0}]
[null,null,null,null,null,null,"Workload-Individual-RefOutTests-Q2-16-2","Tests Referred Out - Haematinic Assays - Vitamin B12 (active)",{"$f":"'Workload Data Entry'!D561","v":0}]
[null,null,null,null,null,null,"Workload-Individual-RefOutTests-Q2-16-3","Tests Referred Out - Haematinic Assays - Vitamin B12 (standard)",{"$f":"'Workload Data Entry'!D562","v":0}]
[null,null,null,null,null,null,"Workload-Individual-RefOutTests-Q2-16-4","Tests Referred Out - Haematinic Assays - Total Haematinic Assays",{"$f":"'Workload Data Entry'!D563","v":0}]
[null,null,null,null,null,null,"Workload-Individual-RefOutTests-Q2-17-1","Tests Referred Out - Blood Products and Blood Components - Albumin",{"$f":"'Workload Data Entry'!D566","v":0}]
[null,null,null,null,null,null,"Workload-Individual-RefOutTests-Q2-17-2","Tests Referred Out - Blood Products and Blood Components - Anti-D",{"$f":"'Workload Data Entry'!D567","v":0}]
[null,null,null,null,null,null,"Workload-Individual-RefOutTests-Q2-17-3","Tests Referred Out - Blood Products and Blood Components - Beriplex",{"$f":"'Workload Data Entry'!D568","v":0}]
[null,null,null,null,null,null,"Workload-Individual-RefOutTests-Q2-17-4","Tests Referred Out - Blood Products and Blood Components - Coagulation concentrate",{"$f":"'Workload Data Entry'!D569","v":0}]
[null,null,null,null,null,null,"Workload-Individual-RefOutTests-Q2-17-5","Tests Referred Out - Blood Products and Blood Components - Fibrinogen concentrate",{"$f":"'Workload Data Entry'!D570","v":0}]
[null,null,null,null,null,null,"Workload-Individual-RefOutTests-Q2-17-6","Tests Referred Out - Blood Products and Blood Components - Cryoprecipitate",{"$f":"'Workload Data Entry'!D571","v":0}]
[null,null,null,null,null,null,"Workload-Individual-RefOutTests-Q2-17-7","Tests Referred Out - Blood Products and Blood Components - Fresh frozen plasma",{"$f":"'Workload Data Entry'!D572","v":0}]
[null,null,null,null,null,null,"Workload-Individual-RefOutTests-Q2-17-8","Tests Referred Out - Blood Products and Blood Components - Intravenous immunoglobulin",{"$f":"'Workload Data Entry'!D573","v":0}]
[null,null,null,null,null,null,"Workload-Individual-RefOutTests-Q2-17-9","Tests Referred Out - Blood Products and Blood Components - No. of red blood cell units received from the blood transfusion service",{"$f":"'Workload Data Entry'!D574","v":0}]
[null,null,null,null,null,null,"Workload-Individual-RefOutTests-Q2-17-10","Tests Referred Out - Blood Products and Blood Components - NovoSeven",{"$f":"'Workload Data Entry'!D575","v":0}]
[null,null,null,null,null,null,"Workload-Individual-RefOutTests-Q2-17-11","Tests Referred Out - Blood Products and Blood Components - Platelets",{"$f":"'Workload Data Entry'!D576","v":0}]
[null,null,null,null,null,null,"Workload-Individual-RefOutTests-Q2-17-12","Tests Referred Out - Blood Products and Blood Components - Tetanus immunoglobulin",{"$f":"'Workload Data Entry'!D577","v":0}]
[null,null,null,null,null,null,"Workload-Individual-RefOutTests-Q2-17-13","Tests Referred Out - Blood Products and Blood Components - Viral Inactivated FFP",{"$f":"'Workload Data Entry'!D578","v":0}]
[null,null,null,null,null,null,"Workload-Individual-RefOutTests-Q2-17-14","Tests Referred Out - Blood Products and Blood Components - Total Blood Products and Blood Components",{"$f":"'Workload Data Entry'!D579","v":0}]
[null,null,null,null,null,null,"Workload-Individual-RefOutTests-Q2-18-1","Tests Referred Out - Blood Bank - Antenatal antibody screen",{"$f":"'Workload Data Entry'!D582","v":0}]
[null,null,null,null,null,null,"Workload-Individual-RefOutTests-Q2-18-2","Tests Referred Out - Blood Bank - Antibody identification - all other*",{"$f":"'Workload Data Entry'!D583","v":0}]
[null,null,null,null,null,null,"Workload-Individual-RefOutTests-Q2-18-3","Tests Referred Out - Blood Bank - Antibody identification due to prophylactic Anti-D*",{"$f":"'Workload Data Entry'!D584","v":0}]
[null,null,null,null,null,null,"Workload-Individual-RefOutTests-Q2-18-4","Tests Referred Out - Blood Bank - Antibody screen",{"$f":"'Workload Data Entry'!D585","v":0}]
[null,null,null,null,null,null,"Workload-Individual-RefOutTests-Q2-18-5","Tests Referred Out - Blood Bank - Blood group (see guidance notes)",{"$f":"'Workload Data Entry'!D586","v":0}]
[null,null,null,null,null,null,"Workload-Individual-RefOutTests-Q2-18-6","Tests Referred Out - Blood Bank - DCT",{"$f":"'Workload Data Entry'!D587","v":0}]
[null,null,null,null,null,null,"Workload-Individual-RefOutTests-Q2-18-7","Tests Referred Out - Blood Bank - Electronic crossmatch(3)",{"$f":"'Workload Data Entry'!D588","v":0}]
[null,null,null,null,null,null,"Workload-Individual-RefOutTests-Q2-18-8","Tests Referred Out - Blood Bank - Estimation of large FMH*",{"$f":"'Workload Data Entry'!D589","v":0}]
[null,null,null,null,null,null,"Workload-Individual-RefOutTests-Q2-18-9","Tests Referred Out - Blood Bank - Histocompatibility and Immunogenetics tests",{"$f":"'Workload Data Entry'!D590","v":0}]
[null,null,null,null,null,null,"Workload-Individual-RefOutTests-Q2-18-10","Tests Referred Out - Blood Bank - Kleihauer",{"$f":"'Workload Data Entry'!D591","v":0}]
[null,null,null,null,null,null,"Workload-Individual-RefOutTests-Q2-18-11","Tests Referred Out - Blood Bank - Traditional crossmatch(3)",{"$f":"'Workload Data Entry'!D592","v":0}]
[null,null,null,null,null,null,"Workload-Individual-RefOutTests-Q2-18-12","Tests Referred Out - Blood Bank - Total Blood Bank",{"$f":"'Workload Data Entry'!D593","v":0}]
[null,null,null,null,null,null,"Workload-Individual-RefOutTests-Q2-19-1","Tests Referred Out - Bone Marrow/Stem Cell Procedures - Bone marrow/stem cell manipulations",{"$f":"'Workload Data Entry'!D596","v":0}]
[null,null,null,null,null,null,"Workload-Individual-RefOutTests-Q2-19-2","Tests Referred Out - Bone Marrow/Stem Cell Procedures - Bone marrow/stem cell storage in your department",{"$f":"'Workload Data Entry'!D597","v":0}]
[null,null,null,null,null,null,"Workload-Individual-RefOutTests-Q2-19-3","Tests Referred Out - Bone Marrow/Stem Cell Procedures - Cell culture",{"$f":"'Workload Data Entry'!D598","v":0}]
[null,null,null,null,null,null,"Workload-Individual-RefOutTests-Q2-19-4","Tests Referred Out - Bone Marrow/Stem Cell Procedures - Total Bone Marrow/Stem Cell Procedures",{"$f":"'Workload Data Entry'!D599","v":0}]
[null,null,null,null,null,null,"Workload-Individual-RefOutTests-Q2-20-1","Tests Referred Out - Flow Cytometry - Flow cytometry - CD34",{"$f":"'Workload Data Entry'!D602","v":0}]
[null,null,null,null,null,null,"Workload-Individual-RefOutTests-Q2-20-2","Tests Referred Out - Flow Cytometry - Flow cytometry - MRD (Minimal Residual Disease)",{"$f":"'Workload Data Entry'!D603","v":0}]
[null,null,null,null,null,null,"Workload-Individual-RefOutTests-Q2-20-3","Tests Referred Out - Flow Cytometry - Flow cytometry - Platelets",{"$f":"'Workload Data Entry'!D604","v":0}]
[null,null,null,null,null,null,"Workload-Individual-RefOutTests-Q2-20-4","Tests Referred Out - Flow Cytometry - Section Subtotal - Flow Cytometry",{"$f":"'Workload Data Entry'!D605","v":0}]
[null,null,null,null,null,null,"Workload-Individual-RefOutTests-Q2-21-1","Tests Referred Out - Haemolytic Anaemia - G6PD",{"$f":"'Workload Data Entry'!D608","v":0}]
[null,null,null,null,null,null,"Workload-Individual-RefOutTests-Q2-21-2","Tests Referred Out - Haemolytic Anaemia - Haemoglobin A2",{"$f":"'Workload Data Entry'!D609","v":0}]
[null,null,null,null,null,null,"Workload-Individual-RefOutTests-Q2-21-3","Tests Referred Out - Haemolytic Anaemia - Haemoglobin electrophoresis",{"$f":"'Workload Data Entry'!D610","v":0}]
[null,null,null,null,null,null,"Workload-Individual-RefOutTests-Q2-21-4","Tests Referred Out - Haemolytic Anaemia - HbF",{"$f":"'Workload Data Entry'!D611","v":0}]
[null,null,null,null,null,null,"Workload-Individual-RefOutTests-Q2-21-5","Tests Referred Out - Haemolytic Anaemia - HPLC",{"$f":"'Workload Data Entry'!D612","v":0}]
[null,null,null,null,null,null,"Workload-Individual-RefOutTests-Q2-21-6","Tests Referred Out - Haemolytic Anaemia - Pyruvate kinase",{"$f":"'Workload Data Entry'!D613","v":0}]
[null,null,null,null,null,null,"Workload-Individual-RefOutTests-Q2-21-7","Tests Referred Out - Haemolytic Anaemia - Screening for HS",{"$f":"'Workload Data Entry'!D614","v":0}]
[null,null,null,null,null,null,"Workload-Individual-RefOutTests-Q2-21-8","Tests Referred Out - Haemolytic Anaemia - Sickle cell screening test",{"$f":"'Workload Data Entry'!D615","v":0}]
[null,null,null,null,null,null,"Workload-Individual-RefOutTests-Q2-21-9","Tests Referred Out - Haemolytic Anaemia - Total Haemolytic Anaemia",{"$f":"'Workload Data Entry'!D616","v":0}]
[null,null,null,null,null,null,"Workload-Individual-RefOutTests-Q2-22-1","Tests Referred Out - Radioisotopes - Plasma volume",{"$f":"'Workload Data Entry'!D619","v":0}]
[null,null,null,null,null,null,"Workload-Individual-RefOutTests-Q2-22-2","Tests Referred Out - Radioisotopes - Red cell mass",{"$f":"'Workload Data Entry'!D620","v":0}]
[null,null,null,null,null,null,"Workload-Individual-RefOutTests-Q2-22-3","Tests Referred Out - Radioisotopes - Schilling test",{"$f":"'Workload Data Entry'!D621","v":0}]
[null,null,null,null,null,null,"Workload-Individual-RefOutTests-Q2-22-4","Tests Referred Out - Radioisotopes - Total Radioisotopes",{"$f":"'Workload Data Entry'!D622","v":0}]
[null,null,null,null,null,null,"Workload-Individual-RefOutTests-Q2-23-1","Tests Referred Out - Molecular Tests - JAK - 2 mutations",{"$f":"'Workload Data Entry'!D625","v":0}]
[null,null,null,null,null,null,"Workload-Individual-RefOutTests-Q2-23-2","Tests Referred Out - Molecular Tests - PCR - bcr/abl monitoring",{"$f":"'Workload Data Entry'!D626","v":0}]
[null,null,null,null,null,null,"Workload-Individual-RefOutTests-Q2-23-3","Tests Referred Out - Molecular Tests - CALR",{"$f":"'Workload Data Entry'!D627","v":0}]
[null,null,null,null,null,null,"Workload-Individual-RefOutTests-Q2-23-4","Tests Referred Out - Molecular Tests - MPL",{"$f":"'Workload Data Entry'!D628","v":0}]
[null,null,null,null,null,null,"Workload-Individual-RefOutTests-Q2-23-5","Tests Referred Out - Molecular Tests - ASXL1",{"$f":"'Workload Data Entry'!D629","v":0}]
[null,null,null,null,null,null,"Workload-Individual-RefOutTests-Q2-23-6","Tests Referred Out - Molecular Tests - MYD88",{"$f":"'Workload Data Entry'!D630","v":0}]
[null,null,null,null,null,null,"Workload-Individual-RefOutTests-Q2-23-7","Tests Referred Out - Molecular Tests - Other Molecular Test 1",{"$f":"'Workload Data Entry'!D631","v":0}]
[null,null,null,null,null,null,"Workload-Individual-RefOutTests-Q2-23-8","Tests Referred Out - Molecular Tests - Other Molecular Test 2",{"$f":"'Workload Data Entry'!D632","v":0}]
[null,null,null,null,null,null,"Workload-Individual-RefOutTests-Q2-23-9","Tests Referred Out - Molecular Tests - Other Molecular Test 3",{"$f":"'Workload Data Entry'!D633","v":0}]
[null,null,null,null,null,null,"Workload-Individual-RefOutTests-Q2-23-10","Tests Referred Out - Molecular Tests - Other Molecular Test 4",{"$f":"'Workload Data Entry'!D634","v":0}]
[null,null,null,null,null,null,"Workload-Individual-RefOutTests-Q2-23-11","Tests Referred Out - Molecular Tests - Other Molecular Test 5",{"$f":"'Workload Data Entry'!D635","v":0}]
[null,null,null,null,null,null,"Workload-Individual-RefOutTests-Q2-23-12","Tests Referred Out - Molecular Tests - Other Molecular Test 6",{"$f":"'Workload Data Entry'!D636","v":0}]
[null,null,null,null,null,null,"Workload-Individual-RefOutTests-Q2-23-13","Tests Referred Out - Molecular Tests - Other Molecular Test 7",{"$f":"'Workload Data Entry'!D637","v":0}]
[null,null,null,null,null,null,"Workload-Individual-RefOutTests-Q2-23-14","Tests Referred Out - Molecular Tests - Other Molecular Test 8",{"$f":"'Workload Data Entry'!D638","v":0}]
[null,null,null,null,null,null,"Workload-Individual-RefOutTests-Q2-23-15","Tests Referred Out - Molecular Tests - Other Molecular Test 9",{"$f":"'Workload Data Entry'!D639","v":0}]
[null,null,null,null,null,null,"Workload-Individual-RefOutTests-Q2-23-16","Tests Referred Out - Molecular Tests - Other Molecular Test 10",{"$f":"'Workload Data Entry'!D640","v":0}]
[null,null,null,null,null,null,"Workload-Individual-RefOutTests-Q2-23-17","Tests Referred Out - Molecular Tests - Total Molecular Tests",{"$f":"'Workload Data Entry'!D641","v":0}]
[null,null,null,null,null,null,"Workload-Individual-RefOutTests-Q2-24-1","Tests Referred Out - Remaining Other Tests - Chemistry",{"$f":"'Workload Data Entry'!D644","v":0}]
[null,null,null,null,null,null,"Workload-Individual-RefOutTests-Q2-24-2","Tests Referred Out - Remaining Other Tests - Haematology (Incl Blood Transfusion)",{"$f":"'Workload Data Entry'!D646","v":0}]
[null,null,null,null,null,null,"Workload-Individual-RefOutTests-Q2-24-3","Tests Referred Out - Remaining Other Tests - Immunology",{"$f":"'Workload Data Entry'!D647","v":0}]
[null,null,null,null,null,null,"Workload-Individual-RefOutTests-Q2-24-4","Tests Referred Out - Remaining Other Tests - Combined Blood Sciences",{"$f":"'Workload Data Entry'!D648","v":0}]
[null,null,null,null,null,null,"Workload-Individual-TestsInHouse-Q1-1-1","Tests In-House - Plasma/Serum/Blood - 1,25 Hydroxy Vitamin D",{"$f":"'Workload Data Entry'!E29","v":0}]
[null,null,null,null,null,null,"Workload-Individual-TestsInHouse-Q1-1-2","Tests In-House - Plasma/Serum/Blood - 11-Deoxycortisol",{"$f":"'Workload Data Entry'!E30","v":0}]
[null,null,null,null,null,null,"Workload-Individual-TestsInHouse-Q1-1-3","Tests In-House - Plasma/Serum/Blood - 17 Hydroxy Progesterone",{"$f":"'Workload Data Entry'!E31","v":0}]
[null,null,null,null,null,null,"Workload-Individual-TestsInHouse-Q1-1-4","Tests In-House - Plasma/Serum/Blood - 25 Hydroxy Vitamin D",{"$f":"'Workload Data Entry'!E32","v":0}]
[null,null,null,null,null,null,"Workload-Individual-TestsInHouse-Q1-1-5","Tests In-House - Plasma/Serum/Blood - ACTH",{"$f":"'Workload Data Entry'!E33","v":0}]
[null,null,null,null,null,null,"Workload-Individual-TestsInHouse-Q1-1-6","Tests In-House - Plasma/Serum/Blood - Acyl Carnitine",{"$f":"'Workload Data Entry'!E34","v":0}]
[null,null,null,null,null,null,"Workload-Individual-TestsInHouse-Q1-1-7","Tests In-House - Plasma/Serum/Blood - Adrenaline",{"$f":"'Workload Data Entry'!E35","v":0}]
[null,null,null,null,null,null,"Workload-Individual-TestsInHouse-Q1-1-8","Tests In-House - Plasma/Serum/Blood - Albumin",{"$f":"'Workload Data Entry'!E36","v":0}]
[null,null,null,null,null,null,"Workload-Individual-TestsInHouse-Q1-1-9","Tests In-House - Plasma/Serum/Blood - Alcohol (Ethanol)",{"$f":"'Workload Data Entry'!E37","v":0}]
[null,null,null,null,null,null,"Workload-Individual-TestsInHouse-Q1-1-10","Tests In-House - Plasma/Serum/Blood - Aldosterone",{"$f":"'Workload Data Entry'!E38","v":0}]
[null,null,null,null,null,null,"Workload-Individual-TestsInHouse-Q1-1-11","Tests In-House - Plasma/Serum/Blood - Alkaline phosphatase",{"$f":"'Workload Data Entry'!E39","v":0}]
[null,null,null,null,null,null,"Workload-Individual-TestsInHouse-Q1-1-12","Tests In-House - Plasma/Serum/Blood - Alkaline phosphatase isoenzymes",{"$f":"'Workload Data Entry'!E40","v":0}]
[null,null,null,null,null,null,"Workload-Individual-TestsInHouse-Q1-1-13","Tests In-House - Plasma/Serum/Blood - Alpha 1 Antitrypsin",{"$f":"'Workload Data Entry'!E41","v":0}]
[null,null,null,null,null,null,"Workload-Individual-TestsInHouse-Q1-1-14","Tests In-House - Plasma/Serum/Blood - Alpha 1 Antitrypsin Phenotype",{"$f":"'Workload Data Entry'!E42","v":0}]
[null,null,null,null,null,null,"Workload-Individual-TestsInHouse-Q1-1-15","Tests In-House - Plasma/Serum/Blood - Alpha-fetoprotein (non-Downs)",{"$f":"'Workload Data Entry'!E43","v":0}]
[null,null,null,null,null,null,"Workload-Individual-TestsInHouse-Q1-1-16","Tests In-House - Plasma/Serum/Blood - ALT",{"$f":"'Workload Data Entry'!E44","v":0}]
[null,null,null,null,null,null,"Workload-Individual-TestsInHouse-Q1-1-17","Tests In-House - Plasma/Serum/Blood - Aluminium",{"$f":"'Workload Data Entry'!E45","v":0}]
[null,null,null,null,null,null,"Workload-Individual-TestsInHouse-Q1-1-18","Tests In-House - Plasma/Serum/Blood - Amino Acids",{"$f":"'Workload Data Entry'!E46","v":0}]
[null,null,null,null,null,null,"Workload-Individual-TestsInHouse-Q1-1-19","Tests In-House - Plasma/Serum/Blood - Amiodarone",{"$f":"'Workload Data Entry'!E47","v":0}]
[null,null,null,null,null,null,"Workload-Individual-TestsInHouse-Q1-1-20","Tests In-House - Plasma/Serum/Blood - Amitryptiline",{"$f":"'Workload Data Entry'!E48","v":0}]
[null,null,null,null,null,null,"Workload-Individual-TestsInHouse-Q1-1-21","Tests In-House - Plasma/Serum/Blood - Ammonia",{"$f":"'Workload Data Entry'!E49","v":0}]
[null,null,null,null,null,null,"Workload-Individual-TestsInHouse-Q1-1-22","Tests In-House - Plasma/Serum/Blood - Amylase",{"$f":"'Workload Data Entry'!E50","v":0}]
[null,null,null,null,null,null,"Workload-Individual-TestsInHouse-Q1-1-23","Tests In-House - Plasma/Serum/Blood - Androstenedione",{"$f":"'Workload Data Entry'!E51","v":0}]
[null,null,null,null,null,null,"Workload-Individual-TestsInHouse-Q1-1-24","Tests In-House - Plasma/Serum/Blood - Angiotensin Converting Enzyme",{"$f":"'Workload Data Entry'!E52","v":0}]
[null,null,null,null,null,null,"Workload-Individual-TestsInHouse-Q1-1-25","Tests In-House - Plasma/Serum/Blood - Anti Mullerian hormone",{"$f":"'Workload Data Entry'!E53","v":0}]
[null,null,null,null,null,null,"Workload-Individual-TestsInHouse-Q1-1-26","Tests In-House - Plasma/Serum/Blood - Anti thyroid peroxidase antibodies (TPO)",{"$f":"'Workload Data Entry'!E54","v":0}]
[null,null,null,null,null,null,"Workload-Individual-TestsInHouse-Q1-1-27","Tests In-House - Plasma/Serum/Blood - Antibiotics (Gentamycin)",{"$f":"'Workload Data Entry'!E55","v":0}]
[null,null,null,null,null,null,"Workload-Individual-TestsInHouse-Q1-1-28","Tests In-House - Plasma/Serum/Blood - Antibiotics (Other)",{"$f":"'Workload Data Entry'!E56","v":0}]
[null,null,null,null,null,null,"Workload-Individual-TestsInHouse-Q1-1-29","Tests In-House - Plasma/Serum/Blood - Antibiotics (Tobramycin)",{"$f":"'Workload Data Entry'!E57","v":0}]
[null,null,null,null,null,null,"Workload-Individual-TestsInHouse-Q1-1-30","Tests In-House - Plasma/Serum/Blood - Antibiotics (Vancomycin)",{"$f":"'Workload Data Entry'!E58","v":0}]
[null,null,null,null,null,null,"Workload-Individual-TestsInHouse-Q1-1-31","Tests In-House - Plasma/Serum/Blood - Apo A1",{"$f":"'Workload Data Entry'!E59","v":0}]
[null,null,null,null,null,null,"Workload-Individual-TestsInHouse-Q1-1-32","Tests In-House - Plasma/Serum/Blood - Apo B",{"$f":"'Workload Data Entry'!E60","v":0}]
[null,null,null,null,null,null,"Workload-Individual-TestsInHouse-Q1-1-33","Tests In-House - Plasma/Serum/Blood - Apo E Genotype",{"$f":"'Workload Data Entry'!E61","v":0}]
[null,null,null,null,null,null,"Workload-Individual-TestsInHouse-Q1-1-34","Tests In-House - Plasma/Serum/Blood - Arsenic",{"$f":"'Workload Data Entry'!E62","v":0}]
[null,null,null,null,null,null,"Workload-Individual-TestsInHouse-Q1-1-35","Tests In-House - Plasma/Serum/Blood - Ascorbic acid (Leucocyte)",{"$f":"'Workload Data Entry'!E63","v":0}]
[null,null,null,null,null,null,"Workload-Individual-TestsInHouse-Q1-1-36","Tests In-House - Plasma/Serum/Blood - AST",{"$f":"'Workload Data Entry'!E64","v":0}]
[null,null,null,null,null,null,"Workload-Individual-TestsInHouse-Q1-1-37","Tests In-House - Plasma/Serum/Blood - B hydroxybutyrate",{"$f":"'Workload Data Entry'!E65","v":0}]
[null,null,null,null,null,null,"Workload-Individual-TestsInHouse-Q1-1-38","Tests In-House - Plasma/Serum/Blood - B2 Microglobulin",{"$f":"'Workload Data Entry'!E66","v":0}]
[null,null,null,null,null,null,"Workload-Individual-TestsInHouse-Q1-1-39","Tests In-House - Plasma/Serum/Blood - Bicarbonate",{"$f":"'Workload Data Entry'!E67","v":0}]
[null,null,null,null,null,null,"Workload-Individual-TestsInHouse-Q1-1-40","Tests In-House - Plasma/Serum/Blood - Bile acids",{"$f":"'Workload Data Entry'!E68","v":0}]
[null,null,null,null,null,null,"Workload-Individual-TestsInHouse-Q1-1-41","Tests In-House - Plasma/Serum/Blood - Bilirubin (Conjugated)",{"$f":"'Workload Data Entry'!E69","v":0}]
[null,null,null,null,null,null,"Workload-Individual-TestsInHouse-Q1-1-42","Tests In-House - Plasma/Serum/Blood - Bilirubin (Total)",{"$f":"'Workload Data Entry'!E70","v":0}]
[null,null,null,null,null,null,"Workload-Individual-TestsInHouse-Q1-1-43","Tests In-House - Plasma/Serum/Blood - Bismuth",{"$f":"'Workload Data Entry'!E71","v":0}]
[null,null,null,null,null,null,"Workload-Individual-TestsInHouse-Q1-1-44","Tests In-House - Plasma/Serum/Blood - Blood Gas (count as 1 test, Exclude POCT)",{"$f":"'Workload Data Entry'!E72","v":0}]
[null,null,null,null,null,null,"Workload-Individual-TestsInHouse-Q1-1-45","Tests In-House - Plasma/Serum/Blood - Blood Spot TSH",{"$f":"'Workload Data Entry'!E73","v":0}]
[null,null,null,null,null,null,"Workload-Individual-TestsInHouse-Q1-1-46","Tests In-House - Plasma/Serum/Blood - BNP/NTproBNP",{"$f":"'Workload Data Entry'!E74","v":0}]
[null,null,null,null,null,null,"Workload-Individual-TestsInHouse-Q1-1-47","Tests In-House - Plasma/Serum/Blood - Bone alkaline phosphatase",{"$f":"'Workload Data Entry'!E75","v":0}]
[null,null,null,null,null,null,"Workload-Individual-TestsInHouse-Q1-1-48","Tests In-House - Plasma/Serum/Blood - CA 125",{"$f":"'Workload Data Entry'!E76","v":0}]
[null,null,null,null,null,null,"Workload-Individual-TestsInHouse-Q1-1-49","Tests In-House - Plasma/Serum/Blood - CA 15-3",{"$f":"'Workload Data Entry'!E77","v":0}]
[null,null,null,null,null,null,"Workload-Individual-TestsInHouse-Q1-1-50","Tests In-House - Plasma/Serum/Blood - CA 19-9",{"$f":"'Workload Data Entry'!E78","v":0}]
[null,null,null,null,null,null,"Workload-Individual-TestsInHouse-Q1-1-51","Tests In-House - Plasma/Serum/Blood - Cadmium",{"$f":"'Workload Data Entry'!E79","v":0}]
[null,null,null,null,null,null,"Workload-Individual-TestsInHouse-Q1-1-52","Tests In-House - Plasma/Serum/Blood - Caeruloplasmin",{"$f":"'Workload Data Entry'!E80","v":0}]
[null,null,null,null,null,null,"Workload-Individual-TestsInHouse-Q1-1-53","Tests In-House - Plasma/Serum/Blood - Calcitonin",{"$f":"'Workload Data Entry'!E81","v":0}]
[null,null,null,null,null,null,"Workload-Individual-TestsInHouse-Q1-1-54","Tests In-House - Plasma/Serum/Blood - Calcium",{"$f":"'Workload Data Entry'!E82","v":0}]
[null,null,null,null,null,null,"Workload-Individual-TestsInHouse-Q1-1-55","Tests In-House - Plasma/Serum/Blood - Carbamazepine",{"$f":"'Workload Data Entry'!E83","v":0}]
[null,null,null,null,null,null,"Workload-Individual-TestsInHouse-Q1-1-56","Tests In-House - Plasma/Serum/Blood - Carbohydrate Deficient transferrin",{"$f":"'Workload Data Entry'!E84","v":0}]
[null,null,null,null,null,null,"Workload-Individual-TestsInHouse-Q1-1-57","Tests In-House - Plasma/Serum/Blood - Carboxyhaemoglobin",{"$f":"'Workload Data Entry'!E85","v":0}]
[null,null,null,null,null,null,"Workload-Individual-TestsInHouse-Q1-1-58","Tests In-House - Plasma/Serum/Blood - Carotene",{"$f":"'Workload Data Entry'!E86","v":0}]
[null,null,null,null,null,null,"Workload-Individual-TestsInHouse-Q1-1-59","Tests In-House - Plasma/Serum/Blood - Carotenoids (x1)",{"$f":"'Workload Data Entry'!E87","v":0}]
[null,null,null,null,null,null,"Workload-Individual-TestsInHouse-Q1-1-60","Tests In-House - Plasma/Serum/Blood - CEA",{"$f":"'Workload Data Entry'!E88","v":0}]
[null,null,null,null,null,null,"Workload-Individual-TestsInHouse-Q1-1-61","Tests In-House - Plasma/Serum/Blood - Chloride",{"$f":"'Workload Data Entry'!E89","v":0}]
[null,null,null,null,null,null,"Workload-Individual-TestsInHouse-Q1-1-62","Tests In-House - Plasma/Serum/Blood - Cholesterol",{"$f":"'Workload Data Entry'!E90","v":0}]
[null,null,null,null,null,null,"Workload-Individual-TestsInHouse-Q1-1-63","Tests In-House - Plasma/Serum/Blood - Cholinesterase",{"$f":"'Workload Data Entry'!E91","v":0}]
[null,null,null,null,null,null,"Workload-Individual-TestsInHouse-Q1-1-64","Tests In-House - Plasma/Serum/Blood - Cholinesterase phenotype (count as 1 test)",{"$f":"'Workload Data Entry'!E92","v":0}]
[null,null,null,null,null,null,"Workload-Individual-TestsInHouse-Q1-1-65","Tests In-House - Plasma/Serum/Blood - Chromium",{"$f":"'Workload Data Entry'!E93","v":0}]
[null,null,null,null,null,null,"Workload-Individual-TestsInHouse-Q1-1-66","Tests In-House - Plasma/Serum/Blood - CK (Creatine Kinase)",{"$f":"'Workload Data Entry'!E94","v":0}]
[null,null,null,null,null,null,"Workload-Individual-TestsInHouse-Q1-1-67","Tests In-House - Plasma/Serum/Blood - CKMB Enzymatic",{"$f":"'Workload Data Entry'!E95","v":0}]
[null,null,null,null,null,null,"Workload-Individual-TestsInHouse-Q1-1-68","Tests In-House - Plasma/Serum/Blood - CKMB Mass",{"$f":"'Workload Data Entry'!E96","v":0}]
[null,null,null,null,null,null,"Workload-Individual-TestsInHouse-Q1-1-69","Tests In-House - Plasma/Serum/Blood - Cobalt",{"$f":"'Workload Data Entry'!E97","v":0}]
[null,null,null,null,null,null,"Workload-Individual-TestsInHouse-Q1-1-70","Tests In-House - Plasma/Serum/Blood - Copper",{"$f":"'Workload Data Entry'!E98","v":0}]
[null,null,null,null,null,null,"Workload-Individual-TestsInHouse-Q1-1-71","Tests In-House - Plasma/Serum/Blood - Cortisol",{"$f":"'Workload Data Entry'!E99","v":0}]
[null,null,null,null,null,null,"Workload-Individual-TestsInHouse-Q1-1-72","Tests In-House - Plasma/Serum/Blood - C-Reactive Protein",{"$f":"'Workload Data Entry'!E100","v":0}]
[null,null,null,null,null,null,"Workload-Individual-TestsInHouse-Q1-1-73","Tests In-House - Plasma/Serum/Blood - Creatinine Enzymatic",{"$f":"'Workload Data Entry'!E101","v":0}]
[null,null,null,null,null,null,"Workload-Individual-TestsInHouse-Q1-1-74","Tests In-House - Plasma/Serum/Blood - Creatinine JAFFE",{"$f":"'Workload Data Entry'!E102","v":0}]
[null,null,null,null,null,null,"Workload-Individual-TestsInHouse-Q1-1-75","Tests In-House - Plasma/Serum/Blood - CTx",{"$f":"'Workload Data Entry'!E103","v":0}]
[null,null,null,null,null,null,"Workload-Individual-TestsInHouse-Q1-1-76","Tests In-House - Plasma/Serum/Blood - Cyclic AMP",{"$f":"'Workload Data Entry'!E104","v":0}]
[null,null,null,null,null,null,"Workload-Individual-TestsInHouse-Q1-1-77","Tests In-House - Plasma/Serum/Blood - Cyclosporin",{"$f":"'Workload Data Entry'!E105","v":0}]
[null,null,null,null,null,null,"Workload-Individual-TestsInHouse-Q1-1-78","Tests In-House - Plasma/Serum/Blood - Cystatin",{"$f":"'Workload Data Entry'!E106","v":0}]
[null,null,null,null,null,null,"Workload-Individual-TestsInHouse-Q1-1-79","Tests In-House - Plasma/Serum/Blood - DHAS/DHEAS",{"$f":"'Workload Data Entry'!E107","v":0}]
[null,null,null,null,null,null,"Workload-Individual-TestsInHouse-Q1-1-80","Tests In-House - Plasma/Serum/Blood - Digoxin",{"$f":"'Workload Data Entry'!E108","v":0}]
[null,null,null,null,null,null,"Workload-Individual-TestsInHouse-Q1-1-81","Tests In-House - Plasma/Serum/Blood - Dihydrotestosterone",{"$f":"'Workload Data Entry'!E109","v":0}]
[null,null,null,null,null,null,"Workload-Individual-TestsInHouse-Q1-1-82","Tests In-House - Plasma/Serum/Blood - Dopamine",{"$f":"'Workload Data Entry'!E110","v":0}]
[null,null,null,null,null,null,"Workload-Individual-TestsInHouse-Q1-1-83","Tests In-House - Plasma/Serum/Blood - Downs Screening",{"$f":"'Workload Data Entry'!E111","v":0}]
[null,null,null,null,null,null,"Workload-Individual-TestsInHouse-Q1-1-84","Tests In-House - Plasma/Serum/Blood - Ethosuximide",{"$f":"'Workload Data Entry'!E112","v":0}]
[null,null,null,null,null,null,"Workload-Individual-TestsInHouse-Q1-1-85","Tests In-House - Plasma/Serum/Blood - Ethylene Glycol",{"$f":"'Workload Data Entry'!E113","v":0}]
[null,null,null,null,null,null,"Workload-Individual-TestsInHouse-Q1-1-86","Tests In-House - Plasma/Serum/Blood - Ferritin",{"$f":"'Workload Data Entry'!E114","v":0}]
[null,null,null,null,null,null,"Workload-Individual-TestsInHouse-Q1-1-87","Tests In-House - Plasma/Serum/Blood - Flecainide",{"$f":"'Workload Data Entry'!E115","v":0}]
[null,null,null,null,null,null,"Workload-Individual-TestsInHouse-Q1-1-88","Tests In-House - Plasma/Serum/Blood - Folate",{"$f":"'Workload Data Entry'!E116","v":0}]
[null,null,null,null,null,null,"Workload-Individual-TestsInHouse-Q1-1-89","Tests In-House - Plasma/Serum/Blood - Folate (Red Cell)",{"$f":"'Workload Data Entry'!E117","v":0}]
[null,null,null,null,null,null,"Workload-Individual-TestsInHouse-Q1-1-90","Tests In-House - Plasma/Serum/Blood - Fructosamine",{"$f":"'Workload Data Entry'!E118","v":0}]
[null,null,null,null,null,null,"Workload-Individual-TestsInHouse-Q1-1-91","Tests In-House - Plasma/Serum/Blood - FSH",{"$f":"'Workload Data Entry'!E119","v":0}]
[null,null,null,null,null,null,"Workload-Individual-TestsInHouse-Q1-1-92","Tests In-House - Plasma/Serum/Blood - Gamma Glutamyl Transferase",{"$f":"'Workload Data Entry'!E120","v":0}]
[null,null,null,null,null,null,"Workload-Individual-TestsInHouse-Q1-1-93","Tests In-House - Plasma/Serum/Blood - Gastrin",{"$f":"'Workload Data Entry'!E121","v":0}]
[null,null,null,null,null,null,"Workload-Individual-TestsInHouse-Q1-1-94","Tests In-House - Plasma/Serum/Blood - Glucagon",{"$f":"'Workload Data Entry'!E122","v":0}]
[null,null,null,null,null,null,"Workload-Individual-TestsInHouse-Q1-1-95","Tests In-House - Plasma/Serum/Blood - Glucose",{"$f":"'Workload Data Entry'!E123","v":0}]
[null,null,null,null,null,null,"Workload-Individual-TestsInHouse-Q1-1-96","Tests In-House - Plasma/Serum/Blood - Growth Hormone",{"$f":"'Workload Data Entry'!E124","v":0}]
[null,null,null,null,null,null,"Workload-Individual-TestsInHouse-Q1-1-97","Tests In-House - Plasma/Serum/Blood - Gut hormone screen",{"$f":"'Workload Data Entry'!E125","v":0}]
[null,null,null,null,null,null,"Workload-Individual-TestsInHouse-Q1-1-98","Tests In-House - Plasma/Serum/Blood - Haptoglobin",{"$f":"'Workload Data Entry'!E126","v":0}]
[null,null,null,null,null,null,"Workload-Individual-TestsInHouse-Q1-1-99","Tests In-House - Plasma/Serum/Blood - HbA1c",{"$f":"'Workload Data Entry'!E127","v":0}]
[null,null,null,null,null,null,"Workload-Individual-TestsInHouse-Q1-1-100","Tests In-House - Plasma/Serum/Blood - HCG (Non-Downs)",{"$f":"'Workload Data Entry'!E128","v":0}]
[null,null,null,null,null,null,"Workload-Individual-TestsInHouse-Q1-1-101","Tests In-House - Plasma/Serum/Blood - HDL",{"$f":"'Workload Data Entry'!E129","v":0}]
[null,null,null,null,null,null,"Workload-Individual-TestsInHouse-Q1-1-102","Tests In-House - Plasma/Serum/Blood - HFE Genotype (Haemochromatosis)",{"$f":"'Workload Data Entry'!E130","v":0}]
[null,null,null,null,null,null,"Workload-Individual-TestsInHouse-Q1-1-103","Tests In-House - Plasma/Serum/Blood - Homocysteine",{"$f":"'Workload Data Entry'!E131","v":0}]
[null,null,null,null,null,null,"Workload-Individual-TestsInHouse-Q1-1-104","Tests In-House - Plasma/Serum/Blood - IGF1",{"$f":"'Workload Data Entry'!E132","v":0}]
[null,null,null,null,null,null,"Workload-Individual-TestsInHouse-Q1-1-105","Tests In-House - Plasma/Serum/Blood - IGFBP-3",{"$f":"'Workload Data Entry'!E133","v":0}]
[null,null,null,null,null,null,"Workload-Individual-TestsInHouse-Q1-1-106","Tests In-House - Plasma/Serum/Blood - Inhibin A/B",{"$f":"'Workload Data Entry'!E134","v":0}]
[null,null,null,null,null,null,"Workload-Individual-TestsInHouse-Q1-1-107","Tests In-House - Plasma/Serum/Blood - Insulin",{"$f":"'Workload Data Entry'!E135","v":0}]
[null,null,null,null,null,null,"Workload-Individual-TestsInHouse-Q1-1-108","Tests In-House - Plasma/Serum/Blood - Insulin C-Peptide",{"$f":"'Workload Data Entry'!E136","v":0}]
[null,null,null,null,null,null,"Workload-Individual-TestsInHouse-Q1-1-109","Tests In-House - Plasma/Serum/Blood - Iron",{"$f":"'Workload Data Entry'!E137","v":0}]
[null,null,null,null,null,null,"Workload-Individual-TestsInHouse-Q1-1-110","Tests In-House - Plasma/Serum/Blood - Iron Binding Capacity",{"$f":"'Workload Data Entry'!E138","v":0}]
[null,null,null,null,null,null,"Workload-Individual-TestsInHouse-Q1-1-111","Tests In-House - Plasma/Serum/Blood - Lactate",{"$f":"'Workload Data Entry'!E139","v":0}]
[null,null,null,null,null,null,"Workload-Individual-TestsInHouse-Q1-1-112","Tests In-House - Plasma/Serum/Blood - Lamotrigine",{"$f":"'Workload Data Entry'!E140","v":0}]
[null,null,null,null,null,null,"Workload-Individual-TestsInHouse-Q1-1-113","Tests In-House - Plasma/Serum/Blood - LDH",{"$f":"'Workload Data Entry'!E141","v":0}]
[null,null,null,null,null,null,"Workload-Individual-TestsInHouse-Q1-1-114","Tests In-House - Plasma/Serum/Blood - LDL (Direct)",{"$f":"'Workload Data Entry'!E142","v":0}]
[null,null,null,null,null,null,"Workload-Individual-TestsInHouse-Q1-1-115","Tests In-House - Plasma/Serum/Blood - Lead",{"$f":"'Workload Data Entry'!E143","v":0}]
[null,null,null,null,null,null,"Workload-Individual-TestsInHouse-Q1-1-116","Tests In-House - Plasma/Serum/Blood - Leptin",{"$f":"'Workload Data Entry'!E144","v":0}]
[null,null,null,null,null,null,"Workload-Individual-TestsInHouse-Q1-1-117","Tests In-House - Plasma/Serum/Blood - LH",{"$f":"'Workload Data Entry'!E145","v":0}]
[null,null,null,null,null,null,"Workload-Individual-TestsInHouse-Q1-1-118","Tests In-House - Plasma/Serum/Blood - Lipoprotein Lipase",{"$f":"'Workload Data Entry'!E146","v":0}]
[null,null,null,null,null,null,"Workload-Individual-TestsInHouse-Q1-1-119","Tests In-House - Plasma/Serum/Blood - Lithium",{"$f":"'Workload Data Entry'!E147","v":0}]
[null,null,null,null,null,null,"Workload-Individual-TestsInHouse-Q1-1-120","Tests In-House - Plasma/Serum/Blood - Lp(a)",{"$f":"'Workload Data Entry'!E148","v":0}]
[null,null,null,null,null,null,"Workload-Individual-TestsInHouse-Q1-1-121","Tests In-House - Plasma/Serum/Blood - Macroprolactin",{"$f":"'Workload Data Entry'!E149","v":0}]
[null,null,null,null,null,null,"Workload-Individual-TestsInHouse-Q1-1-122","Tests In-House - Plasma/Serum/Blood - Magnesium",{"$f":"'Workload Data Entry'!E150","v":0}]
[null,null,null,null,null,null,"Workload-Individual-TestsInHouse-Q1-1-123","Tests In-House - Plasma/Serum/Blood - Manganese",{"$f":"'Workload Data Entry'!E151","v":0}]
[null,null,null,null,null,null,"Workload-Individual-TestsInHouse-Q1-1-124","Tests In-House - Plasma/Serum/Blood - Mercury",{"$f":"'Workload Data Entry'!E152","v":0}]
[null,null,null,null,null,null,"Workload-Individual-TestsInHouse-Q1-1-125","Tests In-House - Plasma/Serum/Blood - Methaemoglobin",{"$f":"'Workload Data Entry'!E153","v":0}]
[null,null,null,null,null,null,"Workload-Individual-TestsInHouse-Q1-1-126","Tests In-House - Plasma/Serum/Blood - Methanol",{"$f":"'Workload Data Entry'!E154","v":0}]
[null,null,null,null,null,null,"Workload-Individual-TestsInHouse-Q1-1-127","Tests In-House - Plasma/Serum/Blood - Methotrexate",{"$f":"'Workload Data Entry'!E155","v":0}]
[null,null,null,null,null,null,"Workload-Individual-TestsInHouse-Q1-1-128","Tests In-House - Plasma/Serum/Blood - Myoglobin",{"$f":"'Workload Data Entry'!E156","v":0}]
[null,null,null,null,null,null,"Workload-Individual-TestsInHouse-Q1-1-129","Tests In-House - Plasma/Serum/Blood - Neurone Specific Enolase",{"$f":"'Workload Data Entry'!E157","v":0}]
[null,null,null,null,null,null,"Workload-Individual-TestsInHouse-Q1-1-130","Tests In-House - Plasma/Serum/Blood - Noradrenaline",{"$f":"'Workload Data Entry'!E158","v":0}]
[null,null,null,null,null,null,"Workload-Individual-TestsInHouse-Q1-1-131","Tests In-House - Plasma/Serum/Blood - Nortripyline",{"$f":"'Workload Data Entry'!E159","v":0}]
[null,null,null,null,null,null,"Workload-Individual-TestsInHouse-Q1-1-132","Tests In-House - Plasma/Serum/Blood - Oestradiol",{"$f":"'Workload Data Entry'!E160","v":0}]
[null,null,null,null,null,null,"Workload-Individual-TestsInHouse-Q1-1-133","Tests In-House - Plasma/Serum/Blood - Orosomucoid",{"$f":"'Workload Data Entry'!E161","v":0}]
[null,null,null,null,null,null,"Workload-Individual-TestsInHouse-Q1-1-134","Tests In-House - Plasma/Serum/Blood - Osmolality",{"$f":"'Workload Data Entry'!E162","v":0}]
[null,null,null,null,null,null,"Workload-Individual-TestsInHouse-Q1-1-135","Tests In-House - Plasma/Serum/Blood - Osteocalcein",{"$f":"'Workload Data Entry'!E163","v":0}]
[null,null,null,null,null,null,"Workload-Individual-TestsInHouse-Q1-1-136","Tests In-House - Plasma/Serum/Blood - ELF Testing",{"$f":"'Workload Data Entry'!E164","v":0}]
[null,null,null,null,null,null,"Workload-Individual-TestsInHouse-Q1-1-137","Tests In-House - Plasma/Serum/Blood - P111NP (Only those not already included in ELF testing)",{"$f":"'Workload Data Entry'!E165","v":0}]
[null,null,null,null,null,null,"Workload-Individual-TestsInHouse-Q1-1-138","Tests In-House - Plasma/Serum/Blood - P1CP (bone markers)",{"$f":"'Workload Data Entry'!E166","v":0}]
[null,null,null,null,null,null,"Workload-Individual-TestsInHouse-Q1-1-139","Tests In-House - Plasma/Serum/Blood - P1NP (bone markers)",{"$f":"'Workload Data Entry'!E167","v":0}]
[null,null,null,null,null,null,"Workload-Individual-TestsInHouse-Q1-1-140","Tests In-House - Plasma/Serum/Blood - Pancreatic Polypeptide",{"$f":"'Workload Data Entry'!E168","v":0}]
[null,null,null,null,null,null,"Workload-Individual-TestsInHouse-Q1-1-141","Tests In-House - Plasma/Serum/Blood - Paracetamol",{"$f":"'Workload Data Entry'!E169","v":0}]
[null,null,null,null,null,null,"Workload-Individual-TestsInHouse-Q1-1-142","Tests In-House - Plasma/Serum/Blood - Phenobarbitone",{"$f":"'Workload Data Entry'!E170","v":0}]
[null,null,null,null,null,null,"Workload-Individual-TestsInHouse-Q1-1-143","Tests In-House - Plasma/Serum/Blood - Phenytoin",{"$f":"'Workload Data Entry'!E171","v":0}]
[null,null,null,null,null,null,"Workload-Individual-TestsInHouse-Q1-1-144","Tests In-House - Plasma/Serum/Blood - Phosphate",{"$f":"'Workload Data Entry'!E172","v":0}]
[null,null,null,null,null,null,"Workload-Individual-TestsInHouse-Q1-1-145","Tests In-House - Plasma/Serum/Blood - PKU for Neonatal Screening",{"$f":"'Workload Data Entry'!E173","v":0}]
[null,null,null,null,null,null,"Workload-Individual-TestsInHouse-Q1-1-146","Tests In-House - Plasma/Serum/Blood - Placental Alkaline Phosphatase",{"$f":"'Workload Data Entry'!E174","v":0}]
[null,null,null,null,null,null,"Workload-Individual-TestsInHouse-Q1-1-147","Tests In-House - Plasma/Serum/Blood - Porphyrins",{"$f":"'Workload Data Entry'!E175","v":0}]
[null,null,null,null,null,null,"Workload-Individual-TestsInHouse-Q1-1-148","Tests In-House - Plasma/Serum/Blood - Potassium",{"$f":"'Workload Data Entry'!E176","v":0}]
[null,null,null,null,null,null,"Workload-Individual-TestsInHouse-Q1-1-149","Tests In-House - Plasma/Serum/Blood - Procalcitonin",{"$f":"'Workload Data Entry'!E177","v":0}]
[null,null,null,null,null,null,"Workload-Individual-TestsInHouse-Q1-1-150","Tests In-House - Plasma/Serum/Blood - Progesterone",{"$f":"'Workload Data Entry'!E178","v":0}]
[null,null,null,null,null,null,"Workload-Individual-TestsInHouse-Q1-1-151","Tests In-House - Plasma/Serum/Blood - Proinsulin",{"$f":"'Workload Data Entry'!E179","v":0}]
[null,null,null,null,null,null,"Workload-Individual-TestsInHouse-Q1-1-152","Tests In-House - Plasma/Serum/Blood - Prolactin",{"$f":"'Workload Data Entry'!E180","v":0}]
[null,null,null,null,null,null,"Workload-Individual-TestsInHouse-Q1-1-153","Tests In-House - Plasma/Serum/Blood - Protein S100",{"$f":"'Workload Data Entry'!E181","v":0}]
[null,null,null,null,null,null,"Workload-Individual-TestsInHouse-Q1-1-154","Tests In-House - Plasma/Serum/Blood - PSA (Free)",{"$f":"'Workload Data Entry'!E182","v":0}]
[null,null,null,null,null,null,"Workload-Individual-TestsInHouse-Q1-1-155","Tests In-House - Plasma/Serum/Blood - PSA (Total)",{"$f":"'Workload Data Entry'!E183","v":0}]
[null,null,null,null,null,null,"Workload-Individual-TestsInHouse-Q1-1-156","Tests In-House - Plasma/Serum/Blood - PTH",{"$f":"'Workload Data Entry'!E184","v":0}]
[null,null,null,null,null,null,"Workload-Individual-TestsInHouse-Q1-1-157","Tests In-House - Plasma/Serum/Blood - PTHrP",{"$f":"'Workload Data Entry'!E185","v":0}]
[null,null,null,null,null,null,"Workload-Individual-TestsInHouse-Q1-1-158","Tests In-House - Plasma/Serum/Blood - Pyruvate",{"$f":"'Workload Data Entry'!E186","v":0}]
[null,null,null,null,null,null,"Workload-Individual-TestsInHouse-Q1-1-159","Tests In-House - Plasma/Serum/Blood - Quantitative thyroid hormone binding",{"$f":"'Workload Data Entry'!E187","v":0}]
[null,null,null,null,null,null,"Workload-Individual-TestsInHouse-Q1-1-160","Tests In-House - Plasma/Serum/Blood - Renin Activity",{"$f":"'Workload Data Entry'!E188","v":0}]
[null,null,null,null,null,null,"Workload-Individual-TestsInHouse-Q1-1-161","Tests In-House - Plasma/Serum/Blood - Salicylate",{"$f":"'Workload Data Entry'!E189","v":0}]
[null,null,null,null,null,null,"Workload-Individual-TestsInHouse-Q1-1-162","Tests In-House - Plasma/Serum/Blood - Selenium",{"$f":"'Workload Data Entry'!E190","v":0}]
[null,null,null,null,null,null,"Workload-Individual-TestsInHouse-Q1-1-163","Tests In-House - Plasma/Serum/Blood - SHBG",{"$f":"'Workload Data Entry'!E191","v":0}]
[null,null,null,null,null,null,"Workload-Individual-TestsInHouse-Q1-1-164","Tests In-House - Plasma/Serum/Blood - Sirolimus",{"$f":"'Workload Data Entry'!E192","v":0}]
[null,null,null,null,null,null,"Workload-Individual-TestsInHouse-Q1-1-165","Tests In-House - Plasma/Serum/Blood - Sodium",{"$f":"'Workload Data Entry'!E193","v":0}]
[null,null,null,null,null,null,"Workload-Individual-TestsInHouse-Q1-1-166","Tests In-House - Plasma/Serum/Blood - Somatostatin",{"$f":"'Workload Data Entry'!E194","v":0}]
[null,null,null,null,null,null,"Workload-Individual-TestsInHouse-Q1-1-167","Tests In-House - Plasma/Serum/Blood - Sulphonylureas",{"$f":"'Workload Data Entry'!E195","v":0}]
[null,null,null,null,null,null,"Workload-Individual-TestsInHouse-Q1-1-168","Tests In-House - Plasma/Serum/Blood - T3 (free)",{"$f":"'Workload Data Entry'!E196","v":0}]
[null,null,null,null,null,null,"Workload-Individual-TestsInHouse-Q1-1-169","Tests In-House - Plasma/Serum/Blood - T3 (Total)",{"$f":"'Workload Data Entry'!E197","v":0}]
[null,null,null,null,null,null,"Workload-Individual-TestsInHouse-Q1-1-170","Tests In-House - Plasma/Serum/Blood - T4 (Free)",{"$f":"'Workload Data Entry'!E198","v":0}]
[null,null,null,null,null,null,"Workload-Individual-TestsInHouse-Q1-1-171","Tests In-House - Plasma/Serum/Blood - T4 (Total)",{"$f":"'Workload Data Entry'!E199","v":0}]
[null,null,null,null,null,null,"Workload-Individual-TestsInHouse-Q1-1-172","Tests In-House - Plasma/Serum/Blood - Tacrolimus (FK 506)",{"$f":"'Workload Data Entry'!E200","v":0}]
[null,null,null,null,null,null,"Workload-Individual-TestsInHouse-Q1-1-173","Tests In-House - Plasma/Serum/Blood - Testosterone",{"$f":"'Workload Data Entry'!E201","v":0}]
[null,null,null,null,null,null,"Workload-Individual-TestsInHouse-Q1-1-174","Tests In-House - Plasma/Serum/Blood - Theophyline",{"$f":"'Workload Data Entry'!E202","v":0}]
[null,null,null,null,null,null,"Workload-Individual-TestsInHouse-Q1-1-175","Tests In-House - Plasma/Serum/Blood - Thiamine Diphosphate",{"$f":"'Workload Data Entry'!E203","v":0}]
[null,null,null,null,null,null,"Workload-Individual-TestsInHouse-Q1-1-176","Tests In-House - Plasma/Serum/Blood - Thyroglobulin",{"$f":"'Workload Data Entry'!E204","v":0}]
[null,null,null,null,null,null,"Workload-Individual-TestsInHouse-Q1-1-177","Tests In-House - Plasma/Serum/Blood - Thyroid Binding Globulin",{"$f":"'Workload Data Entry'!E205","v":0}]
[null,null,null,null,null,null,"Workload-Individual-TestsInHouse-Q1-1-178","Tests In-House - Plasma/Serum/Blood - Total Protein",{"$f":"'Workload Data Entry'!E206","v":0}]
[null,null,null,null,null,null,"Workload-Individual-TestsInHouse-Q1-1-179","Tests In-House - Plasma/Serum/Blood - TPMT",{"$f":"'Workload Data Entry'!E207","v":0}]
[null,null,null,null,null,null,"Workload-Individual-TestsInHouse-Q1-1-180","Tests In-House - Plasma/Serum/Blood - Transferrin",{"$f":"'Workload Data Entry'!E208","v":0}]
[null,null,null,null,null,null,"Workload-Individual-TestsInHouse-Q1-1-181","Tests In-House - Plasma/Serum/Blood - Transketolase",{"$f":"'Workload Data Entry'!E209","v":0}]
[null,null,null,null,null,null,"Workload-Individual-TestsInHouse-Q1-1-182","Tests In-House - Plasma/Serum/Blood - Triglyceride",{"$f":"'Workload Data Entry'!E210","v":0}]
[null,null,null,null,null,null,"Workload-Individual-TestsInHouse-Q1-1-183","Tests In-House - Plasma/Serum/Blood - Troponin I",{"$f":"'Workload Data Entry'!E211","v":0}]
[null,null,null,null,null,null,"Workload-Individual-TestsInHouse-Q1-1-184","Tests In-House - Plasma/Serum/Blood - Troponin T",{"$f":"'Workload Data Entry'!E212","v":0}]
[null,null,null,null,null,null,"Workload-Individual-TestsInHouse-Q1-1-185","Tests In-House - Plasma/Serum/Blood - TSH (Routine)",{"$f":"'Workload Data Entry'!E213","v":0}]
[null,null,null,null,null,null,"Workload-Individual-TestsInHouse-Q1-1-186","Tests In-House - Plasma/Serum/Blood - TSH Receptor AB",{"$f":"'Workload Data Entry'!E214","v":0}]
[null,null,null,null,null,null,"Workload-Individual-TestsInHouse-Q1-1-187","Tests In-House - Plasma/Serum/Blood - Urea",{"$f":"'Workload Data Entry'!E215","v":0}]
[null,null,null,null,null,null,"Workload-Individual-TestsInHouse-Q1-1-188","Tests In-House - Plasma/Serum/Blood - Uric Acid",{"$f":"'Workload Data Entry'!E216","v":0}]
[null,null,null,null,null,null,"Workload-Individual-TestsInHouse-Q1-1-189","Tests In-House - Plasma/Serum/Blood - Valproate",{"$f":"'Workload Data Entry'!E217","v":0}]
[null,null,null,null,null,null,"Workload-Individual-TestsInHouse-Q1-1-190","Tests In-House - Plasma/Serum/Blood - Vasoactive Intestinal Polypeptide",{"$f":"'Workload Data Entry'!E218","v":0}]
[null,null,null,null,null,null,"Workload-Individual-TestsInHouse-Q1-1-191","Tests In-House - Plasma/Serum/Blood - Vitamin A",{"$f":"'Workload Data Entry'!E219","v":0}]
[null,null,null,null,null,null,"Workload-Individual-TestsInHouse-Q1-1-192","Tests In-House - Plasma/Serum/Blood - Vitamin B6",{"$f":"'Workload Data Entry'!E220","v":0}]
[null,null,null,null,null,null,"Workload-Individual-TestsInHouse-Q1-1-193","Tests In-House - Plasma/Serum/Blood - Vitamin C",{"$f":"'Workload Data Entry'!E221","v":0}]
[null,null,null,null,null,null,"Workload-Individual-TestsInHouse-Q1-1-194","Tests In-House - Plasma/Serum/Blood - Vitamin E",{"$f":"'Workload Data Entry'!E222","v":0}]
[null,null,null,null,null,null,"Workload-Individual-TestsInHouse-Q1-1-195","Tests In-House - Plasma/Serum/Blood - White cell enzymes",{"$f":"'Workload Data Entry'!E223","v":0}]
[null,null,null,null,null,null,"Workload-Individual-TestsInHouse-Q1-1-196","Tests In-House - Plasma/Serum/Blood - Zinc",{"$f":"'Workload Data Entry'!E224","v":0}]
[null,null,null,null,null,null,"Workload-Individual-TestsInHouse-Q1-1-197","Tests In-House - Plasma/Serum/Blood - Total Plasma/Serum/Blood Tests",{"$f":"'Workload Data Entry'!E225","v":0}]
[null,null,null,null,null,null,"Workload-Individual-TestsInHouse-Q1-2-1","Tests In-House - Urine Drugs of Abuse - Amphetamine",{"$f":"'Workload Data Entry'!E228","v":0}]
[null,null,null,null,null,null,"Workload-Individual-TestsInHouse-Q1-2-2","Tests In-House - Urine Drugs of Abuse - Barbiturates",{"$f":"'Workload Data Entry'!E229","v":0}]
[null,null,null,null,null,null,"Workload-Individual-TestsInHouse-Q1-2-3","Tests In-House - Urine Drugs of Abuse - Benzodiazepine",{"$f":"'Workload Data Entry'!E230","v":0}]
[null,null,null,null,null,null,"Workload-Individual-TestsInHouse-Q1-2-4","Tests In-House - Urine Drugs of Abuse - Buprenorphine",{"$f":"'Workload Data Entry'!E231","v":0}]
[null,null,null,null,null,null,"Workload-Individual-TestsInHouse-Q1-2-5","Tests In-House - Urine Drugs of Abuse - Cannabis",{"$f":"'Workload Data Entry'!E232","v":0}]
[null,null,null,null,null,null,"Workload-Individual-TestsInHouse-Q1-2-6","Tests In-House - Urine Drugs of Abuse - Cocaine",{"$f":"'Workload Data Entry'!E233","v":0}]
[null,null,null,null,null,null,"Workload-Individual-TestsInHouse-Q1-2-7","Tests In-House - Urine Drugs of Abuse - GC/MS Confirmation",{"$f":"'Workload Data Entry'!E234","v":0}]
[null,null,null,null,null,null,"Workload-Individual-TestsInHouse-Q1-2-8","Tests In-House - Urine Drugs of Abuse - LSD",{"$f":"'Workload Data Entry'!E235","v":0}]
[null,null,null,null,null,null,"Workload-Individual-TestsInHouse-Q1-2-9","Tests In-House - Urine Drugs of Abuse - Methadone",{"$f":"'Workload Data Entry'!E236","v":0}]
[null,null,null,null,null,null,"Workload-Individual-TestsInHouse-Q1-2-10","Tests In-House - Urine Drugs of Abuse - Opiates",{"$f":"'Workload Data Entry'!E237","v":0}]
[null,null,null,null,null,null,"Workload-Individual-TestsInHouse-Q1-2-11","Tests In-House - Urine Drugs of Abuse - Rapid Slide test (e.g. Triage, InstAlert etc)",{"$f":"'Workload Data Entry'!E238","v":0}]
[null,null,null,null,null,null,"Workload-Individual-TestsInHouse-Q1-2-12","Tests In-House - Urine Drugs of Abuse - TLC confirmation",{"$f":"'Workload Data Entry'!E239","v":0}]
[null,null,null,null,null,null,"Workload-Individual-TestsInHouse-Q1-2-13","Tests In-House - Urine Drugs of Abuse - Total Urine Drugs of Abuse",{"$f":"'Workload Data Entry'!E240","v":0}]
[null,null,null,null,null,null,"Workload-Individual-TestsInHouse-Q1-3-1","Tests In-House - Other Urine Tests - 5 Hydroxy Indole Acetic Acid",{"$f":"'Workload Data Entry'!E243","v":0}]
[null,null,null,null,null,null,"Workload-Individual-TestsInHouse-Q1-3-2","Tests In-House - Other Urine Tests - Albumin/Microalbumin (urine)",{"$f":"'Workload Data Entry'!E244","v":0}]
[null,null,null,null,null,null,"Workload-Individual-TestsInHouse-Q1-3-3","Tests In-House - Other Urine Tests - Alcohol",{"$f":"'Workload Data Entry'!E245","v":0}]
[null,null,null,null,null,null,"Workload-Individual-TestsInHouse-Q1-3-4","Tests In-House - Other Urine Tests - Amino acid profiles (x1)",{"$f":"'Workload Data Entry'!E246","v":0}]
[null,null,null,null,null,null,"Workload-Individual-TestsInHouse-Q1-3-5","Tests In-House - Other Urine Tests - Amylase",{"$f":"'Workload Data Entry'!E247","v":0}]
[null,null,null,null,null,null,"Workload-Individual-TestsInHouse-Q1-3-6","Tests In-House - Other Urine Tests - B2 Microglobulin",{"$f":"'Workload Data Entry'!E248","v":0}]
[null,null,null,null,null,null,"Workload-Individual-TestsInHouse-Q1-3-7","Tests In-House - Other Urine Tests - Bilirbubin",{"$f":"'Workload Data Entry'!E249","v":0}]
[null,null,null,null,null,null,"Workload-Individual-TestsInHouse-Q1-3-8","Tests In-House - Other Urine Tests - Calcium",{"$f":"'Workload Data Entry'!E250","v":0}]
[null,null,null,null,null,null,"Workload-Individual-TestsInHouse-Q1-3-9","Tests In-House - Other Urine Tests - Catecholamines (including metadrenaline), HPLC (count as 1 test)",{"$f":"'Workload Data Entry'!E251","v":0}]
[null,null,null,null,null,null,"Workload-Individual-TestsInHouse-Q1-3-10","Tests In-House - Other Urine Tests - Chloride",{"$f":"'Workload Data Entry'!E252","v":0}]
[null,null,null,null,null,null,"Workload-Individual-TestsInHouse-Q1-3-11","Tests In-House - Other Urine Tests - Copper",{"$f":"'Workload Data Entry'!E253","v":0}]
[null,null,null,null,null,null,"Workload-Individual-TestsInHouse-Q1-3-12","Tests In-House - Other Urine Tests - Cortisol (UFC)",{"$f":"'Workload Data Entry'!E254","v":0}]
[null,null,null,null,null,null,"Workload-Individual-TestsInHouse-Q1-3-13","Tests In-House - Other Urine Tests - Cotinine",{"$f":"'Workload Data Entry'!E255","v":0}]
[null,null,null,null,null,null,"Workload-Individual-TestsInHouse-Q1-3-14","Tests In-House - Other Urine Tests - Creatinine",{"$f":"'Workload Data Entry'!E256","v":0}]
[null,null,null,null,null,null,"Workload-Individual-TestsInHouse-Q1-3-15","Tests In-House - Other Urine Tests - Cystine",{"$f":"'Workload Data Entry'!E257","v":0}]
[null,null,null,null,null,null,"Workload-Individual-TestsInHouse-Q1-3-16","Tests In-House - Other Urine Tests - DPD",{"$f":"'Workload Data Entry'!E258","v":0}]
[null,null,null,null,null,null,"Workload-Individual-TestsInHouse-Q1-3-17","Tests In-House - Other Urine Tests - Glucose",{"$f":"'Workload Data Entry'!E259","v":0}]
[null,null,null,null,null,null,"Workload-Individual-TestsInHouse-Q1-3-18","Tests In-House - Other Urine Tests - Iron",{"$f":"'Workload Data Entry'!E260","v":0}]
[null,null,null,null,null,null,"Workload-Individual-TestsInHouse-Q1-3-19","Tests In-House - Other Urine Tests - Laxative screen",{"$f":"'Workload Data Entry'!E261","v":0}]
[null,null,null,null,null,null,"Workload-Individual-TestsInHouse-Q1-3-20","Tests In-House - Other Urine Tests - Light Chains",{"$f":"'Workload Data Entry'!E262","v":0}]
[null,null,null,null,null,null,"Workload-Individual-TestsInHouse-Q1-3-21","Tests In-House - Other Urine Tests - Magnesium",{"$f":"'Workload Data Entry'!E263","v":0}]
[null,null,null,null,null,null,"Workload-Individual-TestsInHouse-Q1-3-22","Tests In-House - Other Urine Tests - Mercury",{"$f":"'Workload Data Entry'!E264","v":0}]
[null,null,null,null,null,null,"Workload-Individual-TestsInHouse-Q1-3-23","Tests In-House - Other Urine Tests - Mucopolysaccharides",{"$f":"'Workload Data Entry'!E265","v":0}]
[null,null,null,null,null,null,"Workload-Individual-TestsInHouse-Q1-3-24","Tests In-House - Other Urine Tests - Myoglobin",{"$f":"'Workload Data Entry'!E266","v":0}]
[null,null,null,null,null,null,"Workload-Individual-TestsInHouse-Q1-3-25","Tests In-House - Other Urine Tests - NAG",{"$f":"'Workload Data Entry'!E267","v":0}]
[null,null,null,null,null,null,"Workload-Individual-TestsInHouse-Q1-3-26","Tests In-House - Other Urine Tests - Nitrogen",{"$f":"'Workload Data Entry'!E268","v":0}]
[null,null,null,null,null,null,"Workload-Individual-TestsInHouse-Q1-3-27","Tests In-House - Other Urine Tests - Normetadrenaline",{"$f":"'Workload Data Entry'!E269","v":0}]
[null,null,null,null,null,null,"Workload-Individual-TestsInHouse-Q1-3-28","Tests In-House - Other Urine Tests - Organic acids",{"$f":"'Workload Data Entry'!E270","v":0}]
[null,null,null,null,null,null,"Workload-Individual-TestsInHouse-Q1-3-29","Tests In-House - Other Urine Tests - Osmolality",{"$f":"'Workload Data Entry'!E271","v":0}]
[null,null,null,null,null,null,"Workload-Individual-TestsInHouse-Q1-3-30","Tests In-House - Other Urine Tests - Oxalate",{"$f":"'Workload Data Entry'!E272","v":0}]
[null,null,null,null,null,null,"Workload-Individual-TestsInHouse-Q1-3-31","Tests In-House - Other Urine Tests - Paraquat",{"$f":"'Workload Data Entry'!E273","v":0}]
[null,null,null,null,null,null,"Workload-Individual-TestsInHouse-Q1-3-32","Tests In-House - Other Urine Tests - Phosphate",{"$f":"'Workload Data Entry'!E274","v":0}]
[null,null,null,null,null,null,"Workload-Individual-TestsInHouse-Q1-3-33","Tests In-House - Other Urine Tests - Porphobilinogen",{"$f":"'Workload Data Entry'!E275","v":0}]
[null,null,null,null,null,null,"Workload-Individual-TestsInHouse-Q1-3-34","Tests In-House - Other Urine Tests - Porphyrins",{"$f":"'Workload Data Entry'!E276","v":0}]
[null,null,null,null,null,null,"Workload-Individual-TestsInHouse-Q1-3-35","Tests In-House - Other Urine Tests - Potassium",{"$f":"'Workload Data Entry'!E277","v":0}]
[null,null,null,null,null,null,"Workload-Individual-TestsInHouse-Q1-3-36","Tests In-House - Other Urine Tests - Pregnancy Test (not by quantitation of HCG)",{"$f":"'Workload Data Entry'!E278","v":0}]
[null,null,null,null,null,null,"Workload-Individual-TestsInHouse-Q1-3-37","Tests In-House - Other Urine Tests - Protein (24hr)",{"$f":"'Workload Data Entry'!E279","v":0}]
[null,null,null,null,null,null,"Workload-Individual-TestsInHouse-Q1-3-38","Tests In-House - Other Urine Tests - Protein (reported as creatinine ratio)",{"$f":"'Workload Data Entry'!E280","v":0}]
[null,null,null,null,null,null,"Workload-Individual-TestsInHouse-Q1-3-39","Tests In-House - Other Urine Tests - Reducing substances",{"$f":"'Workload Data Entry'!E281","v":0}]
[null,null,null,null,null,null,"Workload-Individual-TestsInHouse-Q1-3-40","Tests In-House - Other Urine Tests - Sodium",{"$f":"'Workload Data Entry'!E282","v":0}]
[null,null,null,null,null,null,"Workload-Individual-TestsInHouse-Q1-3-41","Tests In-House - Other Urine Tests - Steroid Profile (x1)",{"$f":"'Workload Data Entry'!E283","v":0}]
[null,null,null,null,null,null,"Workload-Individual-TestsInHouse-Q1-3-42","Tests In-House - Other Urine Tests - Urate",{"$f":"'Workload Data Entry'!E284","v":0}]
[null,null,null,null,null,null,"Workload-Individual-TestsInHouse-Q1-3-43","Tests In-House - Other Urine Tests - Urea",{"$f":"'Workload Data Entry'!E285","v":0}]
[null,null,null,null,null,null,"Workload-Individual-TestsInHouse-Q1-3-44","Tests In-House - Other Urine Tests - Urine volume",{"$f":"'Workload Data Entry'!E286","v":0}]
[null,null,null,null,null,null,"Workload-Individual-TestsInHouse-Q1-3-45","Tests In-House - Other Urine Tests - Urobilinogen",{"$f":"'Workload Data Entry'!E287","v":0}]
[null,null,null,null,null,null,"Workload-Individual-TestsInHouse-Q1-3-46","Tests In-House - Other Urine Tests - Total Other Urine Tests",{"$f":"'Workload Data Entry'!E288","v":0}]
[null,null,null,null,null,null,"Workload-Individual-TestsInHouse-Q1-4-1","Tests In-House - Fluids Tests - Albumin",{"$f":"'Workload Data Entry'!E291","v":0}]
[null,null,null,null,null,null,"Workload-Individual-TestsInHouse-Q1-4-2","Tests In-House - Fluids Tests - Alpha-fetoprotein",{"$f":"'Workload Data Entry'!E292","v":0}]
[null,null,null,null,null,null,"Workload-Individual-TestsInHouse-Q1-4-3","Tests In-House - Fluids Tests - Amylase",{"$f":"'Workload Data Entry'!E293","v":0}]
[null,null,null,null,null,null,"Workload-Individual-TestsInHouse-Q1-4-4","Tests In-House - Fluids Tests - Creatinine",{"$f":"'Workload Data Entry'!E294","v":0}]
[null,null,null,null,null,null,"Workload-Individual-TestsInHouse-Q1-4-5","Tests In-House - Fluids Tests - CSF Glucose",{"$f":"'Workload Data Entry'!E295","v":0}]
[null,null,null,null,null,null,"Workload-Individual-TestsInHouse-Q1-4-6","Tests In-House - Fluids Tests - CSF IgG",{"$f":"'Workload Data Entry'!E296","v":0}]
[null,null,null,null,null,null,"Workload-Individual-TestsInHouse-Q1-4-7","Tests In-House - Fluids Tests - CSF Protein",{"$f":"'Workload Data Entry'!E297","v":0}]
[null,null,null,null,null,null,"Workload-Individual-TestsInHouse-Q1-4-8","Tests In-House - Fluids Tests - Glucose",{"$f":"'Workload Data Entry'!E298","v":0}]
[null,null,null,null,null,null,"Workload-Individual-TestsInHouse-Q1-4-9","Tests In-House - Fluids Tests - HCG",{"$f":"'Workload Data Entry'!E299","v":0}]
[null,null,null,null,null,null,"Workload-Individual-TestsInHouse-Q1-4-10","Tests In-House - Fluids Tests - Lactate Dehydrogenase",{"$f":"'Workload Data Entry'!E300","v":0}]
[null,null,null,null,null,null,"Workload-Individual-TestsInHouse-Q1-4-11","Tests In-House - Fluids Tests - pH",{"$f":"'Workload Data Entry'!E301","v":0}]
[null,null,null,null,null,null,"Workload-Individual-TestsInHouse-Q1-4-12","Tests In-House - Fluids Tests - Potassium",{"$f":"'Workload Data Entry'!E302","v":0}]
[null,null,null,null,null,null,"Workload-Individual-TestsInHouse-Q1-4-13","Tests In-House - Fluids Tests - Protein",{"$f":"'Workload Data Entry'!E303","v":0}]
[null,null,null,null,null,null,"Workload-Individual-TestsInHouse-Q1-4-14","Tests In-House - Fluids Tests - Sodium",{"$f":"'Workload Data Entry'!E304","v":0}]
[null,null,null,null,null,null,"Workload-Individual-TestsInHouse-Q1-4-15","Tests In-House - Fluids Tests - Sweat Tests",{"$f":"'Workload Data Entry'!E305","v":0}]
[null,null,null,null,null,null,"Workload-Individual-TestsInHouse-Q1-4-16","Tests In-House - Fluids Tests - Tau protein",{"$f":"'Workload Data Entry'!E306","v":0}]
[null,null,null,null,null,null,"Workload-Individual-TestsInHouse-Q1-4-17","Tests In-House - Fluids Tests - Urate",{"$f":"'Workload Data Entry'!E307","v":0}]
[null,null,null,null,null,null,"Workload-Individual-TestsInHouse-Q1-4-18","Tests In-House - Fluids Tests - Urea",{"$f":"'Workload Data Entry'!E308","v":0}]
[null,null,null,null,null,null,"Workload-Individual-TestsInHouse-Q1-4-19","Tests In-House - Fluids Tests - Xanthochromia (spectrophotometric)",{"$f":"'Workload Data Entry'!E309","v":0}]
[null,null,null,null,null,null,"Workload-Individual-TestsInHouse-Q1-4-20","Tests In-House - Fluids Tests - Total Fluids",{"$f":"'Workload Data Entry'!E310","v":0}]
[null,null,null,null,null,null,"Workload-Individual-TestsInHouse-Q1-5-1","Tests In-House - Immunochemistry Tests - C1 Inhibitor antigenic assay",{"$f":"'Workload Data Entry'!E313","v":0}]
[null,null,null,null,null,null,"Workload-Individual-TestsInHouse-Q1-5-2","Tests In-House - Immunochemistry Tests - C1 Inhibitor autoantibodies ",{"$f":"'Workload Data Entry'!E314","v":0}]
[null,null,null,null,null,null,"Workload-Individual-TestsInHouse-Q1-5-3","Tests In-House - Immunochemistry Tests - C1 Inhibitor functional assay",{"$f":"'Workload Data Entry'!E315","v":0}]
[null,null,null,null,null,null,"Workload-Individual-TestsInHouse-Q1-5-4","Tests In-House - Immunochemistry Tests - C1q autoantibody",{"$f":"'Workload Data Entry'!E316","v":0}]
[null,null,null,null,null,null,"Workload-Individual-TestsInHouse-Q1-5-5","Tests In-House - Immunochemistry Tests - C3 quantitation",{"$f":"'Workload Data Entry'!E317","v":0}]
[null,null,null,null,null,null,"Workload-Individual-TestsInHouse-Q1-5-6","Tests In-House - Immunochemistry Tests - C3d evaluations",{"$f":"'Workload Data Entry'!E318","v":0}]
[null,null,null,null,null,null,"Workload-Individual-TestsInHouse-Q1-5-7","Tests In-House - Immunochemistry Tests - C4 quantitation",{"$f":"'Workload Data Entry'!E319","v":0}]
[null,null,null,null,null,null,"Workload-Individual-TestsInHouse-Q1-5-8","Tests In-House - Immunochemistry Tests - CH50 or 100/AltCH50 or 100 ",{"$f":"'Workload Data Entry'!E320","v":0}]
[null,null,null,null,null,null,"Workload-Individual-TestsInHouse-Q1-5-9","Tests In-House - Immunochemistry Tests - Complement activation e.g. for C3a C5a etc.",{"$f":"'Workload Data Entry'!E321","v":0}]
[null,null,null,null,null,null,"Workload-Individual-TestsInHouse-Q1-5-10","Tests In-House - Immunochemistry Tests - Complement component e.g. C2, C8 etc",{"$f":"'Workload Data Entry'!E322","v":0}]
[null,null,null,null,null,null,"Workload-Individual-TestsInHouse-Q1-5-11","Tests In-House - Immunochemistry Tests - Cryofibrinogen studies",{"$f":"'Workload Data Entry'!E323","v":0}]
[null,null,null,null,null,null,"Workload-Individual-TestsInHouse-Q1-5-12","Tests In-House - Immunochemistry Tests - Cryoglobulin screen",{"$f":"'Workload Data Entry'!E324","v":0}]
[null,null,null,null,null,null,"Workload-Individual-TestsInHouse-Q1-5-13","Tests In-House - Immunochemistry Tests - Cryoglobulin typing",{"$f":"'Workload Data Entry'!E325","v":0}]
[null,null,null,null,null,null,"Workload-Individual-TestsInHouse-Q1-5-14","Tests In-House - Immunochemistry Tests - CSF Oligoclonal Bands",{"$f":"'Workload Data Entry'!E326","v":0}]
[null,null,null,null,null,null,"Workload-Individual-TestsInHouse-Q1-5-15","Tests In-House - Immunochemistry Tests - Cytokine Levels",{"$f":"'Workload Data Entry'!E327","v":0}]
[null,null,null,null,null,null,"Workload-Individual-TestsInHouse-Q1-5-16","Tests In-House - Immunochemistry Tests - IgA",{"$f":"'Workload Data Entry'!E328","v":0}]
[null,null,null,null,null,null,"Workload-Individual-TestsInHouse-Q1-5-17","Tests In-House - Immunochemistry Tests - IgD",{"$f":"'Workload Data Entry'!E329","v":0}]
[null,null,null,null,null,null,"Workload-Individual-TestsInHouse-Q1-5-18","Tests In-House - Immunochemistry Tests - IgG",{"$f":"'Workload Data Entry'!E330","v":0}]
[null,null,null,null,null,null,"Workload-Individual-TestsInHouse-Q1-5-19","Tests In-House - Immunochemistry Tests - IgG subclasses (G1, 2, 3 and 4)",{"$f":"'Workload Data Entry'!E331","v":0}]
[null,null,null,null,null,null,"Workload-Individual-TestsInHouse-Q1-5-20","Tests In-House - Immunochemistry Tests - IgM",{"$f":"'Workload Data Entry'!E332","v":0}]
[null,null,null,null,null,null,"Workload-Individual-TestsInHouse-Q1-5-21","Tests In-House - Immunochemistry Tests - Mannose binding lectin",{"$f":"'Workload Data Entry'!E333","v":0}]
[null,null,null,null,null,null,"Workload-Individual-TestsInHouse-Q1-5-22","Tests In-House - Immunochemistry Tests - Protein electrophoresis",{"$f":"'Workload Data Entry'!E334","v":0}]
[null,null,null,null,null,null,"Workload-Individual-TestsInHouse-Q1-5-23","Tests In-House - Immunochemistry Tests - Serum free light chains",{"$f":"'Workload Data Entry'!E335","v":0}]
[null,null,null,null,null,null,"Workload-Individual-TestsInHouse-Q1-5-24","Tests In-House - Immunochemistry Tests - Serum paraprotein quantitation",{"$f":"'Workload Data Entry'!E336","v":0}]
[null,null,null,null,null,null,"Workload-Individual-TestsInHouse-Q1-5-25","Tests In-House - Immunochemistry Tests - Serum paraprotein immunotyping",{"$f":"'Workload Data Entry'!E337","v":0}]
[null,null,null,null,null,null,"Workload-Individual-TestsInHouse-Q1-5-26","Tests In-House - Immunochemistry Tests - Serum paraprotein immunofixation",{"$f":"'Workload Data Entry'!E338","v":0}]
[null,null,null,null,null,null,"Workload-Individual-TestsInHouse-Q1-5-27","Tests In-House - Immunochemistry Tests - Urine electrophoresis",{"$f":"'Workload Data Entry'!E339","v":0}]
[null,null,null,null,null,null,"Workload-Individual-TestsInHouse-Q1-5-28","Tests In-House - Immunochemistry Tests - Urine immunofixation",{"$f":"'Workload Data Entry'!E340","v":0}]
[null,null,null,null,null,null,"Workload-Individual-TestsInHouse-Q1-5-29","Tests In-House - Immunochemistry Tests - VEGF",{"$f":"'Workload Data Entry'!E341","v":0}]
[null,null,null,null,null,null,"Workload-Individual-TestsInHouse-Q1-5-30","Tests In-House - Immunochemistry Tests - Total Immunochemistry Tests",{"$f":"'Workload Data Entry'!E342","v":0}]
[null,null,null,null,null,null,"Workload-Individual-TestsInHouse-Q1-6-1","Tests In-House - Other Chemistry Tests - Bloodspot 17-OHProgesterone",{"$f":"'Workload Data Entry'!E345","v":0}]
[null,null,null,null,null,null,"Workload-Individual-TestsInHouse-Q1-6-2","Tests In-House - Other Chemistry Tests - Faecal Calprotectin",{"$f":"'Workload Data Entry'!E346","v":0}]
[null,null,null,null,null,null,"Workload-Individual-TestsInHouse-Q1-6-3","Tests In-House - Other Chemistry Tests - Faecal chromatography",{"$f":"'Workload Data Entry'!E347","v":0}]
[null,null,null,null,null,null,"Workload-Individual-TestsInHouse-Q1-6-4","Tests In-House - Other Chemistry Tests - Faecal Elastase",{"$f":"'Workload Data Entry'!E348","v":0}]
[null,null,null,null,null,null,"Workload-Individual-TestsInHouse-Q1-6-5","Tests In-House - Other Chemistry Tests - Faecal Fat",{"$f":"'Workload Data Entry'!E349","v":0}]
[null,null,null,null,null,null,"Workload-Individual-TestsInHouse-Q1-6-6","Tests In-House - Other Chemistry Tests - Faecal Immunochemical Tests (FIT)",{"$f":"'Workload Data Entry'!E350","v":0}]
[null,null,null,null,null,null,"Workload-Individual-TestsInHouse-Q1-6-7","Tests In-House - Other Chemistry Tests - Faecal Occult Blood (non-immuno)",{"$f":"'Workload Data Entry'!E351","v":0}]
[null,null,null,null,null,null,"Workload-Individual-TestsInHouse-Q1-6-8","Tests In-House - Other Chemistry Tests - Faecal Ph",{"$f":"'Workload Data Entry'!E352","v":0}]
[null,null,null,null,null,null,"Workload-Individual-TestsInHouse-Q1-6-9","Tests In-House - Other Chemistry Tests - Faecal reducing substances",{"$f":"'Workload Data Entry'!E353","v":0}]
[null,null,null,null,null,null,"Workload-Individual-TestsInHouse-Q1-6-10","Tests In-House - Other Chemistry Tests - Faecal Total Porphyrins",{"$f":"'Workload Data Entry'!E354","v":0}]
[null,null,null,null,null,null,"Workload-Individual-TestsInHouse-Q1-6-11","Tests In-House - Other Chemistry Tests - Faecal Weight",{"$f":"'Workload Data Entry'!E355","v":0}]
[null,null,null,null,null,null,"Workload-Individual-TestsInHouse-Q1-6-12","Tests In-House - Other Chemistry Tests - Immuno-reactive trypsin",{"$f":"'Workload Data Entry'!E356","v":0}]
[null,null,null,null,null,null,"Workload-Individual-TestsInHouse-Q1-6-13","Tests In-House - Other Chemistry Tests - Liver Iron",{"$f":"'Workload Data Entry'!E357","v":0}]
[null,null,null,null,null,null,"Workload-Individual-TestsInHouse-Q1-6-14","Tests In-House - Other Chemistry Tests - Renal Calculus",{"$f":"'Workload Data Entry'!E358","v":0}]
[null,null,null,null,null,null,"Workload-Individual-TestsInHouse-Q1-6-15","Tests In-House - Other Chemistry Tests - Urea Breath Test",{"$f":"'Workload Data Entry'!E359","v":0}]
[null,null,null,null,null,null,"Workload-Individual-TestsInHouse-Q1-6-16","Tests In-House - Other Chemistry Tests - Total Other Chemistry Tests",{"$f":"'Workload Data Entry'!E360","v":0}]
[null,null,null,null,null,null,"Workload-Individual-TestsInHouse-Q1-7-1","Tests In-House - Autoimmune Serology Tests - 68kD inner ear protein antibodies",{"$f":"'Workload Data Entry'!E364","v":0}]
[null,null,null,null,null,null,"Workload-Individual-TestsInHouse-Q1-7-2","Tests In-House - Autoimmune Serology Tests - Acetyl choline receptor antibodies",{"$f":"'Workload Data Entry'!E365","v":0}]
[null,null,null,null,null,null,"Workload-Individual-TestsInHouse-Q1-7-3","Tests In-House - Autoimmune Serology Tests - Adrenal antibodies",{"$f":"'Workload Data Entry'!E366","v":0}]
[null,null,null,null,null,null,"Workload-Individual-TestsInHouse-Q1-7-4","Tests In-House - Autoimmune Serology Tests - AMPA 1 & 2 antibodies",{"$f":"'Workload Data Entry'!E367","v":0}]
[null,null,null,null,null,null,"Workload-Individual-TestsInHouse-Q1-7-5","Tests In-House - Autoimmune Serology Tests - ANA screen on Hep2/Hep2000",{"$f":"'Workload Data Entry'!E368","v":0}]
[null,null,null,null,null,null,"Workload-Individual-TestsInHouse-Q1-7-6","Tests In-House - Autoimmune Serology Tests - ANA screen on other substrate",{"$f":"'Workload Data Entry'!E369","v":0}]
[null,null,null,null,null,null,"Workload-Individual-TestsInHouse-Q1-7-7","Tests In-House - Autoimmune Serology Tests - ANA titre on Hep2/Hep2000/other substrate (one test per sample NOT each dilution)",{"$f":"'Workload Data Entry'!E370","v":0}]
[null,null,null,null,null,null,"Workload-Individual-TestsInHouse-Q1-7-8","Tests In-House - Autoimmune Serology Tests - ANCA  - immunoassay for PR3 antibodies = 1 test",{"$f":"'Workload Data Entry'!E371","v":0}]
[null,null,null,null,null,null,"Workload-Individual-TestsInHouse-Q1-7-9","Tests In-House - Autoimmune Serology Tests - ANCA - immunoassay for MPO antbodies = 1 test",{"$f":"'Workload Data Entry'!E372","v":0}]
[null,null,null,null,null,null,"Workload-Individual-TestsInHouse-Q1-7-10","Tests In-House - Autoimmune Serology Tests - ANCA by indirect immunofluorescence = 1 test",{"$f":"'Workload Data Entry'!E373","v":0}]
[null,null,null,null,null,null,"Workload-Individual-TestsInHouse-Q1-7-11","Tests In-House - Autoimmune Serology Tests - Aquaporin 4 antibodies",{"$f":"'Workload Data Entry'!E374","v":0}]
[null,null,null,null,null,null,"Workload-Individual-TestsInHouse-Q1-7-12","Tests In-House - Autoimmune Serology Tests - Basal ganglia antibodies",{"$f":"'Workload Data Entry'!E375","v":0}]
[null,null,null,null,null,null,"Workload-Individual-TestsInHouse-Q1-7-13","Tests In-House - Autoimmune Serology Tests - Beta-2 glycoprotein 1 antibodies (IgG)",{"$f":"'Workload Data Entry'!E376","v":0}]
[null,null,null,null,null,null,"Workload-Individual-TestsInHouse-Q1-7-14","Tests In-House - Autoimmune Serology Tests - Beta-2 glycoprotein 1 antibodies (IgM)",{"$f":"'Workload Data Entry'!E377","v":0}]
[null,null,null,null,null,null,"Workload-Individual-TestsInHouse-Q1-7-15","Tests In-House - Autoimmune Serology Tests - Biological antibodies (e.g. infliximab antibodies)",{"$f":"'Workload Data Entry'!E378","v":0}]
[null,null,null,null,null,null,"Workload-Individual-TestsInHouse-Q1-7-16","Tests In-House - Autoimmune Serology Tests - Biological levels (e.g. infliximab levels)",{"$f":"'Workload Data Entry'!E379","v":0}]
[null,null,null,null,null,null,"Workload-Individual-TestsInHouse-Q1-7-17","Tests In-House - Autoimmune Serology Tests - C1q antibodies",{"$f":"'Workload Data Entry'!E380","v":0}]
[null,null,null,null,null,null,"Workload-Individual-TestsInHouse-Q1-7-18","Tests In-House - Autoimmune Serology Tests - C3 nephritic factor",{"$f":"'Workload Data Entry'!E381","v":0}]
[null,null,null,null,null,null,"Workload-Individual-TestsInHouse-Q1-7-19","Tests In-House - Autoimmune Serology Tests - Cardiac muscle antibodies",{"$f":"'Workload Data Entry'!E382","v":0}]
[null,null,null,null,null,null,"Workload-Individual-TestsInHouse-Q1-7-20","Tests In-House - Autoimmune Serology Tests - Cardiolipin antibodies (IgG)",{"$f":"'Workload Data Entry'!E383","v":0}]
[null,null,null,null,null,null,"Workload-Individual-TestsInHouse-Q1-7-21","Tests In-House - Autoimmune Serology Tests - Cardiolipin antibodies (IgM)",{"$f":"'Workload Data Entry'!E384","v":0}]
[null,null,null,null,null,null,"Workload-Individual-TestsInHouse-Q1-7-22","Tests In-House - Autoimmune Serology Tests - CASPR2 antibodies",{"$f":"'Workload Data Entry'!E385","v":0}]
[null,null,null,null,null,null,"Workload-Individual-TestsInHouse-Q1-7-23","Tests In-House - Autoimmune Serology Tests - Centromere B (CENPB) antibodies - by immunoassay/blot not IIF",{"$f":"'Workload Data Entry'!E386","v":0}]
[null,null,null,null,null,null,"Workload-Individual-TestsInHouse-Q1-7-24","Tests In-House - Autoimmune Serology Tests - Connective tissue disease (CTD) screen (one test per sample)",{"$f":"'Workload Data Entry'!E387","v":0}]
[null,null,null,null,null,null,"Workload-Individual-TestsInHouse-Q1-7-25","Tests In-House - Autoimmune Serology Tests - Cyclic citrullinated proteins (CCP) antibodies",{"$f":"'Workload Data Entry'!E388","v":0}]
[null,null,null,null,null,null,"Workload-Individual-TestsInHouse-Q1-7-26","Tests In-House - Autoimmune Serology Tests - Deamidated-gliadin antibodies",{"$f":"'Workload Data Entry'!E389","v":0}]
[null,null,null,null,null,null,"Workload-Individual-TestsInHouse-Q1-7-27","Tests In-House - Autoimmune Serology Tests - DNA antibodies by immunoassay/ELISA",{"$f":"'Workload Data Entry'!E390","v":0}]
[null,null,null,null,null,null,"Workload-Individual-TestsInHouse-Q1-7-28","Tests In-House - Autoimmune Serology Tests - DNA antibodies by indirect immunofluoresence (Crithidia)",{"$f":"'Workload Data Entry'!E391","v":0}]
[null,null,null,null,null,null,"Workload-Individual-TestsInHouse-Q1-7-29","Tests In-House - Autoimmune Serology Tests - ENA screen (1 test per sample)",{"$f":"'Workload Data Entry'!E392","v":0}]
[null,null,null,null,null,null,"Workload-Individual-TestsInHouse-Q1-7-30","Tests In-House - Autoimmune Serology Tests - Endomysial (IgA) antibodies",{"$f":"'Workload Data Entry'!E393","v":0}]
[null,null,null,null,null,null,"Workload-Individual-TestsInHouse-Q1-7-31","Tests In-House - Autoimmune Serology Tests - Endomysial (IgG) antibodies",{"$f":"'Workload Data Entry'!E394","v":0}]
[null,null,null,null,null,null,"Workload-Individual-TestsInHouse-Q1-7-32","Tests In-House - Autoimmune Serology Tests - Fibrallin antibodies",{"$f":"'Workload Data Entry'!E395","v":0}]
[null,null,null,null,null,null,"Workload-Individual-TestsInHouse-Q1-7-33","Tests In-House - Autoimmune Serology Tests - GABA antibodies",{"$f":"'Workload Data Entry'!E396","v":0}]
[null,null,null,null,null,null,"Workload-Individual-TestsInHouse-Q1-7-34","Tests In-House - Autoimmune Serology Tests - Ganglionic acetyl receptor antibodies",{"$f":"'Workload Data Entry'!E397","v":0}]
[null,null,null,null,null,null,"Workload-Individual-TestsInHouse-Q1-7-35","Tests In-House - Autoimmune Serology Tests - Glomerular basement membrane (GBM) antibodies",{"$f":"'Workload Data Entry'!E398","v":0}]
[null,null,null,null,null,null,"Workload-Individual-TestsInHouse-Q1-7-36","Tests In-House - Autoimmune Serology Tests - Glutamic acid decarboxylase (GAD) antibodies",{"$f":"'Workload Data Entry'!E399","v":0}]
[null,null,null,null,null,null,"Workload-Individual-TestsInHouse-Q1-7-37","Tests In-House - Autoimmune Serology Tests - Glycine receptor antibodies",{"$f":"'Workload Data Entry'!E400","v":0}]
[null,null,null,null,null,null,"Workload-Individual-TestsInHouse-Q1-7-38","Tests In-House - Autoimmune Serology Tests - Ganglioside antibodies",{"$f":"'Workload Data Entry'!E401","v":0}]
[null,null,null,null,null,null,"Workload-Individual-TestsInHouse-Q1-7-39","Tests In-House - Autoimmune Serology Tests - Myelin associated glycoprotein (MAG) antibodies",{"$f":"'Workload Data Entry'!E402","v":0}]
[null,null,null,null,null,null,"Workload-Individual-TestsInHouse-Q1-7-40","Tests In-House - Autoimmune Serology Tests - Beta interferon neutralising antibodies",{"$f":"'Workload Data Entry'!E403","v":0}]
[null,null,null,null,null,null,"Workload-Individual-TestsInHouse-Q1-7-41","Tests In-House - Autoimmune Serology Tests - Granulocyte antibodies",{"$f":"'Workload Data Entry'!E404","v":0}]
[null,null,null,null,null,null,"Workload-Individual-TestsInHouse-Q1-7-42","Tests In-House - Autoimmune Serology Tests - Histone antibodies",{"$f":"'Workload Data Entry'!E405","v":0}]
[null,null,null,null,null,null,"Workload-Individual-TestsInHouse-Q1-7-43","Tests In-House - Autoimmune Serology Tests - HMCoA antibodies",{"$f":"'Workload Data Entry'!E406","v":0}]
[null,null,null,null,null,null,"Workload-Individual-TestsInHouse-Q1-7-44","Tests In-House - Autoimmune Serology Tests - IA-2 antibodies",{"$f":"'Workload Data Entry'!E407","v":0}]
[null,null,null,null,null,null,"Workload-Individual-TestsInHouse-Q1-7-45","Tests In-House - Autoimmune Serology Tests - ZnT8 antibodies",{"$f":"'Workload Data Entry'!E408","v":0}]
[null,null,null,null,null,null,"Workload-Individual-TestsInHouse-Q1-7-46","Tests In-House - Autoimmune Serology Tests - Insulin antibodies",{"$f":"'Workload Data Entry'!E409","v":0}]
[null,null,null,null,null,null,"Workload-Individual-TestsInHouse-Q1-7-47","Tests In-House - Autoimmune Serology Tests - Intrinsic factor antibodies",{"$f":"'Workload Data Entry'!E410","v":0}]
[null,null,null,null,null,null,"Workload-Individual-TestsInHouse-Q1-7-48","Tests In-House - Autoimmune Serology Tests - Islet cell antibodies",{"$f":"'Workload Data Entry'!E411","v":0}]
[null,null,null,null,null,null,"Workload-Individual-TestsInHouse-Q1-7-49","Tests In-House - Autoimmune Serology Tests - Jo-1 antibodies",{"$f":"'Workload Data Entry'!E412","v":0}]
[null,null,null,null,null,null,"Workload-Individual-TestsInHouse-Q1-7-50","Tests In-House - Autoimmune Serology Tests - La antibodies",{"$f":"'Workload Data Entry'!E413","v":0}]
[null,null,null,null,null,null,"Workload-Individual-TestsInHouse-Q1-7-51","Tests In-House - Autoimmune Serology Tests - LGIR1 antibodies",{"$f":"'Workload Data Entry'!E414","v":0}]
[null,null,null,null,null,null,"Workload-Individual-TestsInHouse-Q1-7-52","Tests In-House - Autoimmune Serology Tests - Lig1 antibodies",{"$f":"'Workload Data Entry'!E415","v":0}]
[null,null,null,null,null,null,"Workload-Individual-TestsInHouse-Q1-7-53","Tests In-House - Autoimmune Serology Tests - Liver & gastric parietal cell antibodies by indirect immunofluorescence",{"$f":"'Workload Data Entry'!E416","v":0}]
[null,null,null,null,null,null,"Workload-Individual-TestsInHouse-Q1-7-54","Tests In-House - Autoimmune Serology Tests - Liver antibodies by immunoblot (1 test per sample)",{"$f":"'Workload Data Entry'!E417","v":0}]
[null,null,null,null,null,null,"Workload-Individual-TestsInHouse-Q1-7-55","Tests In-House - Autoimmune Serology Tests - Liver antibody titrations (one test per sample NOT each dilution)",{"$f":"'Workload Data Entry'!E418","v":0}]
[null,null,null,null,null,null,"Workload-Individual-TestsInHouse-Q1-7-56","Tests In-House - Autoimmune Serology Tests - Mi-2 antibodies",{"$f":"'Workload Data Entry'!E419","v":0}]
[null,null,null,null,null,null,"Workload-Individual-TestsInHouse-Q1-7-57","Tests In-House - Autoimmune Serology Tests - MOGL antibodies",{"$f":"'Workload Data Entry'!E420","v":0}]
[null,null,null,null,null,null,"Workload-Individual-TestsInHouse-Q1-7-58","Tests In-House - Autoimmune Serology Tests - Muscle specific kinase (MUSK) antibodies",{"$f":"'Workload Data Entry'!E421","v":0}]
[null,null,null,null,null,null,"Workload-Individual-TestsInHouse-Q1-7-59","Tests In-House - Autoimmune Serology Tests - Myositis antibody panel by immunoblot (1 test per sample)",{"$f":"'Workload Data Entry'!E422","v":0}]
[null,null,null,null,null,null,"Workload-Individual-TestsInHouse-Q1-7-60","Tests In-House - Autoimmune Serology Tests - Neuronal antibodies by indirect immunofluorescence",{"$f":"'Workload Data Entry'!E423","v":0}]
[null,null,null,null,null,null,"Workload-Individual-TestsInHouse-Q1-7-61","Tests In-House - Autoimmune Serology Tests - Neuronal antibodies by immunoblot (1 test per sample)",{"$f":"'Workload Data Entry'!E424","v":0}]
[null,null,null,null,null,null,"Workload-Individual-TestsInHouse-Q1-7-62","Tests In-House - Autoimmune Serology Tests - NMDA receptor antibodies",{"$f":"'Workload Data Entry'!E425","v":0}]
[null,null,null,null,null,null,"Workload-Individual-TestsInHouse-Q1-7-63","Tests In-House - Autoimmune Serology Tests - Other anti-phospholipid antibodies",{"$f":"'Workload Data Entry'!E426","v":0}]
[null,null,null,null,null,null,"Workload-Individual-TestsInHouse-Q1-7-64","Tests In-House - Autoimmune Serology Tests - Other autoantibodies by indirect fluorescence",{"$f":"'Workload Data Entry'!E427","v":0}]
[null,null,null,null,null,null,"Workload-Individual-TestsInHouse-Q1-7-65","Tests In-House - Autoimmune Serology Tests - Parathyroid antibodies",{"$f":"'Workload Data Entry'!E428","v":0}]
[null,null,null,null,null,null,"Workload-Individual-TestsInHouse-Q1-7-66","Tests In-House - Autoimmune Serology Tests - PCNA antibodies",{"$f":"'Workload Data Entry'!E429","v":0}]
[null,null,null,null,null,null,"Workload-Individual-TestsInHouse-Q1-7-67","Tests In-House - Autoimmune Serology Tests - Phospholipase A2 (PLA2) receptor antibodies",{"$f":"'Workload Data Entry'!E430","v":0}]
[null,null,null,null,null,null,"Workload-Individual-TestsInHouse-Q1-7-68","Tests In-House - Autoimmune Serology Tests - Pyruvate dehydrogenase (M2) antibodies",{"$f":"'Workload Data Entry'!E431","v":0}]
[null,null,null,null,null,null,"Workload-Individual-TestsInHouse-Q1-7-69","Tests In-House - Autoimmune Serology Tests - Rheumatoid factor by latex agglutination",{"$f":"'Workload Data Entry'!E432","v":0}]
[null,null,null,null,null,null,"Workload-Individual-TestsInHouse-Q1-7-70","Tests In-House - Autoimmune Serology Tests - Rheumatoid factor by quantitative assay",{"$f":"'Workload Data Entry'!E433","v":0}]
[null,null,null,null,null,null,"Workload-Individual-TestsInHouse-Q1-7-71","Tests In-House - Autoimmune Serology Tests - Rheumatoid factor - follow up test",{"$f":"'Workload Data Entry'!E434","v":0}]
[null,null,null,null,null,null,"Workload-Individual-TestsInHouse-Q1-7-72","Tests In-House - Autoimmune Serology Tests - Ribosomal P antibodies",{"$f":"'Workload Data Entry'!E435","v":0}]
[null,null,null,null,null,null,"Workload-Individual-TestsInHouse-Q1-7-73","Tests In-House - Autoimmune Serology Tests - RNA polymerase III antibodies",{"$f":"'Workload Data Entry'!E436","v":0}]
[null,null,null,null,null,null,"Workload-Individual-TestsInHouse-Q1-7-74","Tests In-House - Autoimmune Serology Tests - Ro52 antibodies",{"$f":"'Workload Data Entry'!E437","v":0}]
[null,null,null,null,null,null,"Workload-Individual-TestsInHouse-Q1-7-75","Tests In-House - Autoimmune Serology Tests - Ro60 antibodies",{"$f":"'Workload Data Entry'!E438","v":0}]
[null,null,null,null,null,null,"Workload-Individual-TestsInHouse-Q1-7-76","Tests In-House - Autoimmune Serology Tests - Scl70 antibodies",{"$f":"'Workload Data Entry'!E439","v":0}]
[null,null,null,null,null,null,"Workload-Individual-TestsInHouse-Q1-7-77","Tests In-House - Autoimmune Serology Tests - Skeletal muscle antibodies",{"$f":"'Workload Data Entry'!E440","v":0}]
[null,null,null,null,null,null,"Workload-Individual-TestsInHouse-Q1-7-78","Tests In-House - Autoimmune Serology Tests - Skin abs (ELISA e.g. DSG1/3, BP180/230)",{"$f":"'Workload Data Entry'!E441","v":0}]
[null,null,null,null,null,null,"Workload-Individual-TestsInHouse-Q1-7-79","Tests In-House - Autoimmune Serology Tests - Skin antibodies (e.g. Pemphigus/goid) by indirect immunofluorescence",{"$f":"'Workload Data Entry'!E442","v":0}]
[null,null,null,null,null,null,"Workload-Individual-TestsInHouse-Q1-7-80","Tests In-House - Autoimmune Serology Tests - Sm antibodies",{"$f":"'Workload Data Entry'!E443","v":0}]
[null,null,null,null,null,null,"Workload-Individual-TestsInHouse-Q1-7-81","Tests In-House - Autoimmune Serology Tests - Steroid cell antibodies (Ovary/testes/adrenal antibodies)",{"$f":"'Workload Data Entry'!E444","v":0}]
[null,null,null,null,null,null,"Workload-Individual-TestsInHouse-Q1-7-82","Tests In-House - Autoimmune Serology Tests - Submaxillary gland antibodies",{"$f":"'Workload Data Entry'!E445","v":0}]
[null,null,null,null,null,null,"Workload-Individual-TestsInHouse-Q1-7-83","Tests In-House - Autoimmune Serology Tests - Thyroglobulin antibodies",{"$f":"'Workload Data Entry'!E446","v":0}]
[null,null,null,null,null,null,"Workload-Individual-TestsInHouse-Q1-7-84","Tests In-House - Autoimmune Serology Tests - Thyroid peroxidase antobodies",{"$f":"'Workload Data Entry'!E447","v":0}]
[null,null,null,null,null,null,"Workload-Individual-TestsInHouse-Q1-7-85","Tests In-House - Autoimmune Serology Tests - Tissue transglutaminase antibodies (IgA)",{"$f":"'Workload Data Entry'!E448","v":0}]
[null,null,null,null,null,null,"Workload-Individual-TestsInHouse-Q1-7-86","Tests In-House - Autoimmune Serology Tests - Tissue transglutaminase antibodies (IgG)",{"$f":"'Workload Data Entry'!E449","v":0}]
[null,null,null,null,null,null,"Workload-Individual-TestsInHouse-Q1-7-87","Tests In-House - Autoimmune Serology Tests - TSH receptor antibodies   ",{"$f":"'Workload Data Entry'!E450","v":0}]
[null,null,null,null,null,null,"Workload-Individual-TestsInHouse-Q1-7-88","Tests In-House - Autoimmune Serology Tests - U1 RNP / 70kDa RNP antibodies",{"$f":"'Workload Data Entry'!E451","v":0}]
[null,null,null,null,null,null,"Workload-Individual-TestsInHouse-Q1-7-89","Tests In-House - Autoimmune Serology Tests - Voltage gated calcium channel (VGCC) antibodies",{"$f":"'Workload Data Entry'!E452","v":0}]
[null,null,null,null,null,null,"Workload-Individual-TestsInHouse-Q1-7-90","Tests In-House - Autoimmune Serology Tests - Voltage gated potassium channel (VGKC) antibodies",{"$f":"'Workload Data Entry'!E453","v":0}]
[null,null,null,null,null,null,"Workload-Individual-TestsInHouse-Q1-7-91","Tests In-House - Autoimmune Serology Tests - Total Autoimmune Serology",{"$f":"'Workload Data Entry'!E454","v":0}]
[null,null,null,null,null,null,"Workload-Individual-TestsInHouse-Q1-8-1","Tests In-House - Allergy Tests - Allergen Components Specific IgE",{"$f":"'Workload Data Entry'!E457","v":0}]
[null,null,null,null,null,null,"Workload-Individual-TestsInHouse-Q1-8-2","Tests In-House - Allergy Tests - Allergen Specific IgE",{"$f":"'Workload Data Entry'!E458","v":0}]
[null,null,null,null,null,null,"Workload-Individual-TestsInHouse-Q1-8-3","Tests In-House - Allergy Tests - IgE Total level",{"$f":"'Workload Data Entry'!E459","v":0}]
[null,null,null,null,null,null,"Workload-Individual-TestsInHouse-Q1-8-4","Tests In-House - Allergy Tests - IgG precipitins (Aspergillus, Avian etc…)",{"$f":"'Workload Data Entry'!E460","v":0}]
[null,null,null,null,null,null,"Workload-Individual-TestsInHouse-Q1-8-5","Tests In-House - Allergy Tests - ISAC Test",{"$f":"'Workload Data Entry'!E461","v":0}]
[null,null,null,null,null,null,"Workload-Individual-TestsInHouse-Q1-8-6","Tests In-House - Allergy Tests - Tryptase",{"$f":"'Workload Data Entry'!E462","v":0}]
[null,null,null,null,null,null,"Workload-Individual-TestsInHouse-Q1-8-7","Tests In-House - Allergy Tests - Total Allergy Tests",{"$f":"'Workload Data Entry'!E463","v":0}]
[null,null,null,null,null,null,"Workload-Individual-TestsInHouse-Q1-9-1","Tests In-House - Microbial Serology for Immunocompetence Testing - Meningococcal antibody (MCA)",{"$f":"'Workload Data Entry'!E466","v":0}]
[null,null,null,null,null,null,"Workload-Individual-TestsInHouse-Q1-9-2","Tests In-House - Microbial Serology for Immunocompetence Testing - Diphtheria antibody",{"$f":"'Workload Data Entry'!E467","v":0}]
[null,null,null,null,null,null,"Workload-Individual-TestsInHouse-Q1-9-3","Tests In-House - Microbial Serology for Immunocompetence Testing - Haemophilus influenzae b antibody",{"$f":"'Workload Data Entry'!E468","v":0}]
[null,null,null,null,null,null,"Workload-Individual-TestsInHouse-Q1-9-4","Tests In-House - Microbial Serology for Immunocompetence Testing - Pneumococcal antibody",{"$f":"'Workload Data Entry'!E469","v":0}]
[null,null,null,null,null,null,"Workload-Individual-TestsInHouse-Q1-9-5","Tests In-House - Microbial Serology for Immunocompetence Testing - Pneumococcal serotype specific antibody response (PSSA)",{"$f":"'Workload Data Entry'!E470","v":0}]
[null,null,null,null,null,null,"Workload-Individual-TestsInHouse-Q1-9-6","Tests In-House - Microbial Serology for Immunocompetence Testing - Tetanus antibody",{"$f":"'Workload Data Entry'!E471","v":0}]
[null,null,null,null,null,null,"Workload-Individual-TestsInHouse-Q1-9-7","Tests In-House - Microbial Serology for Immunocompetence Testing - Total Microbial Serology for Immunocompetence Testing",{"$f":"'Workload Data Entry'!E472","v":0}]
[null,null,null,null,null,null,"Workload-Individual-TestsInHouse-Q1-10-1","Tests In-House - Cellular Immunology - B-cell phenotyping for common variable immunodeficiency (IgD/CD27)",{"$f":"'Workload Data Entry'!E475","v":0}]
[null,null,null,null,null,null,"Workload-Individual-TestsInHouse-Q1-10-2","Tests In-House - Cellular Immunology - Cytokine functional studies",{"$f":"'Workload Data Entry'!E476","v":0}]
[null,null,null,null,null,null,"Workload-Individual-TestsInHouse-Q1-10-3","Tests In-House - Cellular Immunology - Gamma interferon assays for TB: in-house assay",{"$f":"'Workload Data Entry'!E477","v":0}]
[null,null,null,null,null,null,"Workload-Individual-TestsInHouse-Q1-10-4","Tests In-House - Cellular Immunology - Gamma interferon assays for TB: quantiferon",{"$f":"'Workload Data Entry'!E478","v":0}]
[null,null,null,null,null,null,"Workload-Individual-TestsInHouse-Q1-10-5","Tests In-House - Cellular Immunology - Gamma interferon assays for TB: T-spot",{"$f":"'Workload Data Entry'!E479","v":0}]
[null,null,null,null,null,null,"Workload-Individual-TestsInHouse-Q1-10-6","Tests In-House - Cellular Immunology - Lymphocyte function assays",{"$f":"'Workload Data Entry'!E480","v":0}]
[null,null,null,null,null,null,"Workload-Individual-TestsInHouse-Q1-10-7","Tests In-House - Cellular Immunology - Specialised functional assays for primary immune deficiency (excluding genetics)",{"$f":"'Workload Data Entry'!E481","v":0}]
[null,null,null,null,null,null,"Workload-Individual-TestsInHouse-Q1-10-8","Tests In-House - Cellular Immunology - Lymphocyte phenotyping/subset for PRIMARY immunodeficiency",{"$f":"'Workload Data Entry'!E482","v":0}]
[null,null,null,null,null,null,"Workload-Individual-TestsInHouse-Q1-10-9","Tests In-House - Cellular Immunology - Lymphocyte phenotyping/subsets for HIV",{"$f":"'Workload Data Entry'!E483","v":0}]
[null,null,null,null,null,null,"Workload-Individual-TestsInHouse-Q1-10-10","Tests In-House - Cellular Immunology - Lymphocyte phenotyping/subsets LEUKAEMIA/LYMPHOMA typing ",{"$f":"'Workload Data Entry'!E484","v":0}]
[null,null,null,null,null,null,"Workload-Individual-TestsInHouse-Q1-10-11","Tests In-House - Cellular Immunology - Natural killer cell assay",{"$f":"'Workload Data Entry'!E485","v":0}]
[null,null,null,null,null,null,"Workload-Individual-TestsInHouse-Q1-10-12","Tests In-House - Cellular Immunology - Neutrophil Adhesion Markers",{"$f":"'Workload Data Entry'!E486","v":0}]
[null,null,null,null,null,null,"Workload-Individual-TestsInHouse-Q1-10-13","Tests In-House - Cellular Immunology - Neutrophil function",{"$f":"'Workload Data Entry'!E487","v":0}]
[null,null,null,null,null,null,"Workload-Individual-TestsInHouse-Q1-10-14","Tests In-House - Cellular Immunology - Neutrophil respiratory burst by flow cytometry",{"$f":"'Workload Data Entry'!E488","v":0}]
[null,null,null,null,null,null,"Workload-Individual-TestsInHouse-Q1-10-15","Tests In-House - Cellular Immunology - Neutrophil respiratory burst by NBT slide assay",{"$f":"'Workload Data Entry'!E489","v":0}]
[null,null,null,null,null,null,"Workload-Individual-TestsInHouse-Q1-10-16","Tests In-House - Cellular Immunology - Total Cellular Immunology",{"$f":"'Workload Data Entry'!E490","v":0}]
[null,null,null,null,null,null,"Workload-Individual-TestsInHouse-Q1-11-1","Tests In-House - Histocompatibility and Immunogenetics Tests - Crossmatching",{"$f":"'Workload Data Entry'!E493","v":0}]
[null,null,null,null,null,null,"Workload-Individual-TestsInHouse-Q1-11-2","Tests In-House - Histocompatibility and Immunogenetics Tests - HFE typing",{"$f":"'Workload Data Entry'!E494","v":0}]
[null,null,null,null,null,null,"Workload-Individual-TestsInHouse-Q1-11-3","Tests In-House - Histocompatibility and Immunogenetics Tests - HLA antibody characterisation",{"$f":"'Workload Data Entry'!E495","v":0}]
[null,null,null,null,null,null,"Workload-Individual-TestsInHouse-Q1-11-4","Tests In-House - Histocompatibility and Immunogenetics Tests - HLA B27 typing flow cytometry",{"$f":"'Workload Data Entry'!E496","v":0}]
[null,null,null,null,null,null,"Workload-Individual-TestsInHouse-Q1-11-5","Tests In-House - Histocompatibility and Immunogenetics Tests - HLA B57 ",{"$f":"'Workload Data Entry'!E497","v":0}]
[null,null,null,null,null,null,"Workload-Individual-TestsInHouse-Q1-11-6","Tests In-House - Histocompatibility and Immunogenetics Tests - HLA Other Disease Association Allele Typing",{"$f":"'Workload Data Entry'!E498","v":0}]
[null,null,null,null,null,null,"Workload-Individual-TestsInHouse-Q1-11-7","Tests In-House - Histocompatibility and Immunogenetics Tests - HLA class I A & B",{"$f":"'Workload Data Entry'!E499","v":0}]
[null,null,null,null,null,null,"Workload-Individual-TestsInHouse-Q1-11-8","Tests In-House - Histocompatibility and Immunogenetics Tests - HLA class I Cw",{"$f":"'Workload Data Entry'!E500","v":0}]
[null,null,null,null,null,null,"Workload-Individual-TestsInHouse-Q1-11-9","Tests In-House - Histocompatibility and Immunogenetics Tests - HLA class II DP",{"$f":"'Workload Data Entry'!E501","v":0}]
[null,null,null,null,null,null,"Workload-Individual-TestsInHouse-Q1-11-10","Tests In-House - Histocompatibility and Immunogenetics Tests - HLA class II DQ",{"$f":"'Workload Data Entry'!E502","v":0}]
[null,null,null,null,null,null,"Workload-Individual-TestsInHouse-Q1-11-11","Tests In-House - Histocompatibility and Immunogenetics Tests - HLA class II DR",{"$f":"'Workload Data Entry'!E503","v":0}]
[null,null,null,null,null,null,"Workload-Individual-TestsInHouse-Q1-11-12","Tests In-House - Histocompatibility and Immunogenetics Tests - Total H&I Tests",{"$f":"'Workload Data Entry'!E504","v":0}]
[null,null,null,null,null,null,"Workload-Individual-TestsInHouse-Q1-12-1","Tests In-House - Immunohistology - Tests In-House for Immunohistology",{"$f":"'Workload Data Entry'!E507","v":0}]
[null,null,null,null,null,null,"Workload-Individual-TestsInHouse-Q1-13-1","Tests In-House - Routine Haematology - Blood film - no report(1)",{"$f":"'Workload Data Entry'!E511","v":0}]
[null,null,null,null,null,null,"Workload-Individual-TestsInHouse-Q1-13-2","Tests In-House - Routine Haematology - Blood film - with report(1)",{"$f":"'Workload Data Entry'!E512","v":0}]
[null,null,null,null,null,null,"Workload-Individual-TestsInHouse-Q1-13-3","Tests In-House - Routine Haematology - ESR",{"$f":"'Workload Data Entry'!E513","v":0}]
[null,null,null,null,null,null,"Workload-Individual-TestsInHouse-Q1-13-4","Tests In-House - Routine Haematology - FBC",{"$f":"'Workload Data Entry'!E514","v":0}]
[null,null,null,null,null,null,"Workload-Individual-TestsInHouse-Q1-13-5","Tests In-House - Routine Haematology - Glandular fever screening",{"$f":"'Workload Data Entry'!E515","v":0}]
[null,null,null,null,null,null,"Workload-Individual-TestsInHouse-Q1-13-6","Tests In-House - Routine Haematology - Malaria parasite film",{"$f":"'Workload Data Entry'!E516","v":0}]
[null,null,null,null,null,null,"Workload-Individual-TestsInHouse-Q1-13-7","Tests In-House - Routine Haematology - Other Malaria Tests",{"$f":"'Workload Data Entry'!E517","v":0}]
[null,null,null,null,null,null,"Workload-Individual-TestsInHouse-Q1-13-8","Tests In-House - Routine Haematology - Plasma viscosity",{"$f":"'Workload Data Entry'!E518","v":0}]
[null,null,null,null,null,null,"Workload-Individual-TestsInHouse-Q1-13-9","Tests In-House - Routine Haematology - Pregnancy test",{"$f":"'Workload Data Entry'!E519","v":0}]
[null,null,null,null,null,null,"Workload-Individual-TestsInHouse-Q1-13-10","Tests In-House - Routine Haematology - Reticulocytes",{"$f":"'Workload Data Entry'!E520","v":0}]
[null,null,null,null,null,null,"Workload-Individual-TestsInHouse-Q1-13-11","Tests In-House - Routine Haematology - Semen Analysis: fertility",{"$f":"'Workload Data Entry'!E521","v":0}]
[null,null,null,null,null,null,"Workload-Individual-TestsInHouse-Q1-13-12","Tests In-House - Routine Haematology - Semen Analysis: post vasectomy",{"$f":"'Workload Data Entry'!E522","v":0}]
[null,null,null,null,null,null,"Workload-Individual-TestsInHouse-Q1-13-13","Tests In-House - Routine Haematology - Total Routine Haematology",{"$f":"'Workload Data Entry'!E523","v":0}]
[null,null,null,null,null,null,"Workload-Individual-TestsInHouse-Q1-14-1","Tests In-House - Bone Marrow Investigations - Aspirate",{"$f":"'Workload Data Entry'!E526","v":0}]
[null,null,null,null,null,null,"Workload-Individual-TestsInHouse-Q1-14-2","Tests In-House - Bone Marrow Investigations - Cytogenetics, eg Not Molecular Diagnostics",{"$f":"'Workload Data Entry'!E527","v":0}]
[null,null,null,null,null,null,"Workload-Individual-TestsInHouse-Q1-14-3","Tests In-House - Bone Marrow Investigations - Immunocytochemistry",{"$f":"'Workload Data Entry'!E528","v":0}]
[null,null,null,null,null,null,"Workload-Individual-TestsInHouse-Q1-14-4","Tests In-House - Bone Marrow Investigations - Iron stains(2)",{"$f":"'Workload Data Entry'!E529","v":0}]
[null,null,null,null,null,null,"Workload-Individual-TestsInHouse-Q1-14-5","Tests In-House - Bone Marrow Investigations - Other cytochemistry",{"$f":"'Workload Data Entry'!E530","v":0}]
[null,null,null,null,null,null,"Workload-Individual-TestsInHouse-Q1-14-6","Tests In-House - Bone Marrow Investigations - Total Bone Marrow Investigations",{"$f":"'Workload Data Entry'!E531","v":0}]
[null,null,null,null,null,null,"Workload-Individual-TestsInHouse-Q1-14-7","Tests In-House - Bone Marrow Investigations - Trephine biopsy",{"$f":"'Workload Data Entry'!E532","v":0}]
[null,null,null,null,null,null,"Workload-Individual-TestsInHouse-Q1-14-8","Tests In-House - Bone Marrow Investigations - Total Bone Marrow Investigations",{"$f":"'Workload Data Entry'!E533","v":0}]
[null,null,null,null,null,null,"Workload-Individual-TestsInHouse-Q1-15-1","Tests In-House - Coagulation - APC resistance",{"$f":"'Workload Data Entry'!E536","v":0}]
[null,null,null,null,null,null,"Workload-Individual-TestsInHouse-Q1-15-2","Tests In-House - Coagulation - APTT",{"$f":"'Workload Data Entry'!E537","v":0}]
[null,null,null,null,null,null,"Workload-Individual-TestsInHouse-Q1-15-3","Tests In-House - Coagulation - AT (Anti Thrombin)",{"$f":"'Workload Data Entry'!E538","v":0}]
[null,null,null,null,null,null,"Workload-Individual-TestsInHouse-Q1-15-4","Tests In-House - Coagulation - Factor assay",{"$f":"'Workload Data Entry'!E539","v":0}]
[null,null,null,null,null,null,"Workload-Individual-TestsInHouse-Q1-15-5","Tests In-House - Coagulation - Factor Xa",{"$f":"'Workload Data Entry'!E540","v":0}]
[null,null,null,null,null,null,"Workload-Individual-TestsInHouse-Q1-15-6","Tests In-House - Coagulation - FDP/D Dimer",{"$f":"'Workload Data Entry'!E541","v":0}]
[null,null,null,null,null,null,"Workload-Individual-TestsInHouse-Q1-15-7","Tests In-House - Coagulation - Fibrinogen: Clauss etc",{"$f":"'Workload Data Entry'!E542","v":0}]
[null,null,null,null,null,null,"Workload-Individual-TestsInHouse-Q1-15-8","Tests In-House - Coagulation - Fibrinogen: derived",{"$f":"'Workload Data Entry'!E543","v":0}]
[null,null,null,null,null,null,"Workload-Individual-TestsInHouse-Q1-15-9","Tests In-House - Coagulation - FV Leiden/Prothrombin G20210A",{"$f":"'Workload Data Entry'!E544","v":0}]
[null,null,null,null,null,null,"Workload-Individual-TestsInHouse-Q1-15-10","Tests In-House - Coagulation - Inhibitor assay",{"$f":"'Workload Data Entry'!E545","v":0}]
[null,null,null,null,null,null,"Workload-Individual-TestsInHouse-Q1-15-11","Tests In-House - Coagulation - Inhibitor screens (not lupus)",{"$f":"'Workload Data Entry'!E546","v":0}]
[null,null,null,null,null,null,"Workload-Individual-TestsInHouse-Q1-15-12","Tests In-House - Coagulation - INR",{"$f":"'Workload Data Entry'!E547","v":0}]
[null,null,null,null,null,null,"Workload-Individual-TestsInHouse-Q1-15-13","Tests In-House - Coagulation - Lupus Anticoagulant",{"$f":"'Workload Data Entry'!E548","v":0}]
[null,null,null,null,null,null,"Workload-Individual-TestsInHouse-Q1-15-14","Tests In-House - Coagulation - NOAC Management",{"$f":"'Workload Data Entry'!E549","v":0}]
[null,null,null,null,null,null,"Workload-Individual-TestsInHouse-Q1-15-15","Tests In-House - Coagulation - Platelet aggregation tests",{"$f":"'Workload Data Entry'!E550","v":0}]
[null,null,null,null,null,null,"Workload-Individual-TestsInHouse-Q1-15-16","Tests In-House - Coagulation - Protein C",{"$f":"'Workload Data Entry'!E551","v":0}]
[null,null,null,null,null,null,"Workload-Individual-TestsInHouse-Q1-15-17","Tests In-House - Coagulation - Protein S",{"$f":"'Workload Data Entry'!E552","v":0}]
[null,null,null,null,null,null,"Workload-Individual-TestsInHouse-Q1-15-18","Tests In-House - Coagulation - PT",{"$f":"'Workload Data Entry'!E553","v":0}]
[null,null,null,null,null,null,"Workload-Individual-TestsInHouse-Q1-15-19","Tests In-House - Coagulation - Reptilase time",{"$f":"'Workload Data Entry'!E554","v":0}]
[null,null,null,null,null,null,"Workload-Individual-TestsInHouse-Q1-15-20","Tests In-House - Coagulation - Thrombin time",{"$f":"'Workload Data Entry'!E555","v":0}]
[null,null,null,null,null,null,"Workload-Individual-TestsInHouse-Q1-15-21","Tests In-House - Coagulation - VWF multimer analysis",{"$f":"'Workload Data Entry'!E556","v":0}]
[null,null,null,null,null,null,"Workload-Individual-TestsInHouse-Q1-15-22","Tests In-House - Coagulation - Section Subtotal - Coagulation",{"$f":"'Workload Data Entry'!E557","v":0}]
[null,null,null,null,null,null,"Workload-Individual-TestsInHouse-Q1-16-1","Tests In-House - Haematinic Assays - Erythropoietin",{"$f":"'Workload Data Entry'!E560","v":0}]
[null,null,null,null,null,null,"Workload-Individual-TestsInHouse-Q1-16-2","Tests In-House - Haematinic Assays - Vitamin B12 (active)",{"$f":"'Workload Data Entry'!E561","v":0}]
[null,null,null,null,null,null,"Workload-Individual-TestsInHouse-Q1-16-3","Tests In-House - Haematinic Assays - Vitamin B12 (standard)",{"$f":"'Workload Data Entry'!E562","v":0}]
[null,null,null,null,null,null,"Workload-Individual-TestsInHouse-Q1-16-4","Tests In-House - Haematinic Assays - Total Haematinic Assays",{"$f":"'Workload Data Entry'!E563","v":0}]
[null,null,null,null,null,null,"Workload-Individual-TestsInHouse-Q1-17-1","Tests In-House - Blood Products and Blood Components - Albumin",{"$f":"'Workload Data Entry'!E566","v":0}]
[null,null,null,null,null,null,"Workload-Individual-TestsInHouse-Q1-17-2","Tests In-House - Blood Products and Blood Components - Anti-D",{"$f":"'Workload Data Entry'!E567","v":0}]
[null,null,null,null,null,null,"Workload-Individual-TestsInHouse-Q1-17-3","Tests In-House - Blood Products and Blood Components - Beriplex",{"$f":"'Workload Data Entry'!E568","v":0}]
[null,null,null,null,null,null,"Workload-Individual-TestsInHouse-Q1-17-4","Tests In-House - Blood Products and Blood Components - Coagulation concentrate",{"$f":"'Workload Data Entry'!E569","v":0}]
[null,null,null,null,null,null,"Workload-Individual-TestsInHouse-Q1-17-5","Tests In-House - Blood Products and Blood Components - Fibrinogen concentrate",{"$f":"'Workload Data Entry'!E570","v":0}]
[null,null,null,null,null,null,"Workload-Individual-TestsInHouse-Q1-17-6","Tests In-House - Blood Products and Blood Components - Cryoprecipitate",{"$f":"'Workload Data Entry'!E571","v":0}]
[null,null,null,null,null,null,"Workload-Individual-TestsInHouse-Q1-17-7","Tests In-House - Blood Products and Blood Components - Fresh frozen plasma",{"$f":"'Workload Data Entry'!E572","v":0}]
[null,null,null,null,null,null,"Workload-Individual-TestsInHouse-Q1-17-8","Tests In-House - Blood Products and Blood Components - Intravenous immunoglobulin",{"$f":"'Workload Data Entry'!E573","v":0}]
[null,null,null,null,null,null,"Workload-Individual-TestsInHouse-Q1-17-9","Tests In-House - Blood Products and Blood Components - No. of red blood cell units received from the blood transfusion service",{"$f":"'Workload Data Entry'!E574","v":0}]
[null,null,null,null,null,null,"Workload-Individual-TestsInHouse-Q1-17-10","Tests In-House - Blood Products and Blood Components - NovoSeven",{"$f":"'Workload Data Entry'!E575","v":0}]
[null,null,null,null,null,null,"Workload-Individual-TestsInHouse-Q1-17-11","Tests In-House - Blood Products and Blood Components - Platelets",{"$f":"'Workload Data Entry'!E576","v":0}]
[null,null,null,null,null,null,"Workload-Individual-TestsInHouse-Q1-17-12","Tests In-House - Blood Products and Blood Components - Tetanus immunoglobulin",{"$f":"'Workload Data Entry'!E577","v":0}]
[null,null,null,null,null,null,"Workload-Individual-TestsInHouse-Q1-17-13","Tests In-House - Blood Products and Blood Components - Viral Inactivated FFP",{"$f":"'Workload Data Entry'!E578","v":0}]
[null,null,null,null,null,null,"Workload-Individual-TestsInHouse-Q1-17-14","Tests In-House - Blood Products and Blood Components - Total Blood Products and Blood Components",{"$f":"'Workload Data Entry'!E579","v":0}]
[null,null,null,null,null,null,"Workload-Individual-TestsInHouse-Q1-18-1","Tests In-House - Blood Bank - Antenatal antibody screen",{"$f":"'Workload Data Entry'!E582","v":0}]
[null,null,null,null,null,null,"Workload-Individual-TestsInHouse-Q1-18-2","Tests In-House - Blood Bank - Antibody identification - all other*",{"$f":"'Workload Data Entry'!E583","v":0}]
[null,null,null,null,null,null,"Workload-Individual-TestsInHouse-Q1-18-3","Tests In-House - Blood Bank - Antibody identification due to prophylactic Anti-D*",{"$f":"'Workload Data Entry'!E584","v":0}]
[null,null,null,null,null,null,"Workload-Individual-TestsInHouse-Q1-18-4","Tests In-House - Blood Bank - Antibody screen",{"$f":"'Workload Data Entry'!E585","v":0}]
[null,null,null,null,null,null,"Workload-Individual-TestsInHouse-Q1-18-5","Tests In-House - Blood Bank - Blood group (see guidance notes)",{"$f":"'Workload Data Entry'!E586","v":0}]
[null,null,null,null,null,null,"Workload-Individual-TestsInHouse-Q1-18-6","Tests In-House - Blood Bank - DCT",{"$f":"'Workload Data Entry'!E587","v":0}]
[null,null,null,null,null,null,"Workload-Individual-TestsInHouse-Q1-18-7","Tests In-House - Blood Bank - Electronic crossmatch(3)",{"$f":"'Workload Data Entry'!E588","v":0}]
[null,null,null,null,null,null,"Workload-Individual-TestsInHouse-Q1-18-8","Tests In-House - Blood Bank - Estimation of large FMH*",{"$f":"'Workload Data Entry'!E589","v":0}]
[null,null,null,null,null,null,"Workload-Individual-TestsInHouse-Q1-18-9","Tests In-House - Blood Bank - Histocompatibility and Immunogenetics tests",{"$f":"'Workload Data Entry'!E590","v":0}]
[null,null,null,null,null,null,"Workload-Individual-TestsInHouse-Q1-18-10","Tests In-House - Blood Bank - Kleihauer",{"$f":"'Workload Data Entry'!E591","v":0}]
[null,null,null,null,null,null,"Workload-Individual-TestsInHouse-Q1-18-11","Tests In-House - Blood Bank - Traditional crossmatch(3)",{"$f":"'Workload Data Entry'!E592","v":0}]
[null,null,null,null,null,null,"Workload-Individual-TestsInHouse-Q1-18-12","Tests In-House - Blood Bank - Total Blood Bank",{"$f":"'Workload Data Entry'!E593","v":0}]
[null,null,null,null,null,null,"Workload-Individual-TestsInHouse-Q1-19-1","Tests In-House - Bone Marrow/Stem Cell Procedures - Bone marrow/stem cell manipulations",{"$f":"'Workload Data Entry'!E596","v":0}]
[null,null,null,null,null,null,"Workload-Individual-TestsInHouse-Q1-19-2","Tests In-House - Bone Marrow/Stem Cell Procedures - Bone marrow/stem cell storage in your department",{"$f":"'Workload Data Entry'!E597","v":0}]
[null,null,null,null,null,null,"Workload-Individual-TestsInHouse-Q1-19-3","Tests In-House - Bone Marrow/Stem Cell Procedures - Cell culture",{"$f":"'Workload Data Entry'!E598","v":0}]
[null,null,null,null,null,null,"Workload-Individual-TestsInHouse-Q1-19-4","Tests In-House - Bone Marrow/Stem Cell Procedures - Total Bone Marrow/Stem Cell Procedures",{"$f":"'Workload Data Entry'!E599","v":0}]
[null,null,null,null,null,null,"Workload-Individual-TestsInHouse-Q1-20-1","Tests In-House - Flow Cytometry - Flow cytometry - CD34",{"$f":"'Workload Data Entry'!E602","v":0}]
[null,null,null,null,null,null,"Workload-Individual-TestsInHouse-Q1-20-2","Tests In-House - Flow Cytometry - Flow cytometry - MRD (Minimal Residual Disease)",{"$f":"'Workload Data Entry'!E603","v":0}]
[null,null,null,null,null,null,"Workload-Individual-TestsInHouse-Q1-20-3","Tests In-House - Flow Cytometry - Flow cytometry - Platelets",{"$f":"'Workload Data Entry'!E604","v":0}]
[null,null,null,null,null,null,"Workload-Individual-TestsInHouse-Q1-20-4","Tests In-House - Flow Cytometry - Section Subtotal - Flow Cytometry",{"$f":"'Workload Data Entry'!E605","v":0}]
[null,null,null,null,null,null,"Workload-Individual-TestsInHouse-Q1-21-1","Tests In-House - Haemolytic Anaemia - G6PD",{"$f":"'Workload Data Entry'!E608","v":0}]
[null,null,null,null,null,null,"Workload-Individual-TestsInHouse-Q1-21-2","Tests In-House - Haemolytic Anaemia - Haemoglobin A2",{"$f":"'Workload Data Entry'!E609","v":0}]
[null,null,null,null,null,null,"Workload-Individual-TestsInHouse-Q1-21-3","Tests In-House - Haemolytic Anaemia - Haemoglobin electrophoresis",{"$f":"'Workload Data Entry'!E610","v":0}]
[null,null,null,null,null,null,"Workload-Individual-TestsInHouse-Q1-21-4","Tests In-House - Haemolytic Anaemia - HbF",{"$f":"'Workload Data Entry'!E611","v":0}]
[null,null,null,null,null,null,"Workload-Individual-TestsInHouse-Q1-21-5","Tests In-House - Haemolytic Anaemia - HPLC",{"$f":"'Workload Data Entry'!E612","v":0}]
[null,null,null,null,null,null,"Workload-Individual-TestsInHouse-Q1-21-6","Tests In-House - Haemolytic Anaemia - Pyruvate kinase",{"$f":"'Workload Data Entry'!E613","v":0}]
[null,null,null,null,null,null,"Workload-Individual-TestsInHouse-Q1-21-7","Tests In-House - Haemolytic Anaemia - Screening for HS",{"$f":"'Workload Data Entry'!E614","v":0}]
[null,null,null,null,null,null,"Workload-Individual-TestsInHouse-Q1-21-8","Tests In-House - Haemolytic Anaemia - Sickle cell screening test",{"$f":"'Workload Data Entry'!E615","v":0}]
[null,null,null,null,null,null,"Workload-Individual-TestsInHouse-Q1-21-9","Tests In-House - Haemolytic Anaemia - Total Haemolytic Anaemia",{"$f":"'Workload Data Entry'!E616","v":0}]
[null,null,null,null,null,null,"Workload-Individual-TestsInHouse-Q1-22-1","Tests In-House - Radioisotopes - Plasma volume",{"$f":"'Workload Data Entry'!E619","v":0}]
[null,null,null,null,null,null,"Workload-Individual-TestsInHouse-Q1-22-2","Tests In-House - Radioisotopes - Red cell mass",{"$f":"'Workload Data Entry'!E620","v":0}]
[null,null,null,null,null,null,"Workload-Individual-TestsInHouse-Q1-22-3","Tests In-House - Radioisotopes - Schilling test",{"$f":"'Workload Data Entry'!E621","v":0}]
[null,null,null,null,null,null,"Workload-Individual-TestsInHouse-Q1-22-4","Tests In-House - Radioisotopes - Total Radioisotopes",{"$f":"'Workload Data Entry'!E622","v":0}]
[null,null,null,null,null,null,"Workload-Individual-TestsInHouse-Q1-23-1","Tests In-House - Molecular Tests - JAK - 2 mutations",{"$f":"'Workload Data Entry'!E625","v":0}]
[null,null,null,null,null,null,"Workload-Individual-TestsInHouse-Q1-23-2","Tests In-House - Molecular Tests - PCR - bcr/abl monitoring",{"$f":"'Workload Data Entry'!E626","v":0}]
[null,null,null,null,null,null,"Workload-Individual-TestsInHouse-Q1-23-3","Tests In-House - Molecular Tests - CALR",{"$f":"'Workload Data Entry'!E627","v":0}]
[null,null,null,null,null,null,"Workload-Individual-TestsInHouse-Q1-23-4","Tests In-House - Molecular Tests - MPL",{"$f":"'Workload Data Entry'!E628","v":0}]
[null,null,null,null,null,null,"Workload-Individual-TestsInHouse-Q1-23-5","Tests In-House - Molecular Tests - ASXL1",{"$f":"'Workload Data Entry'!E629","v":0}]
[null,null,null,null,null,null,"Workload-Individual-TestsInHouse-Q1-23-6","Tests In-House - Molecular Tests - MYD88",{"$f":"'Workload Data Entry'!E630","v":0}]
[null,null,null,null,null,null,"Workload-Individual-TestsInHouse-Q1-23-7","Tests In-House - Molecular Tests - Other Molecular Test 1",{"$f":"'Workload Data Entry'!E631","v":0}]
[null,null,null,null,null,null,"Workload-Individual-TestsInHouse-Q1-23-8","Tests In-House - Molecular Tests - Other Molecular Test 2",{"$f":"'Workload Data Entry'!E632","v":0}]
[null,null,null,null,null,null,"Workload-Individual-TestsInHouse-Q1-23-9","Tests In-House - Molecular Tests - Other Molecular Test 3",{"$f":"'Workload Data Entry'!E633","v":0}]
[null,null,null,null,null,null,"Workload-Individual-TestsInHouse-Q1-23-10","Tests In-House - Molecular Tests - Other Molecular Test 4",{"$f":"'Workload Data Entry'!E634","v":0}]
[null,null,null,null,null,null,"Workload-Individual-TestsInHouse-Q1-23-11","Tests In-House - Molecular Tests - Other Molecular Test 5",{"$f":"'Workload Data Entry'!E635","v":0}]
[null,null,null,null,null,null,"Workload-Individual-TestsInHouse-Q1-23-12","Tests In-House - Molecular Tests - Other Molecular Test 6",{"$f":"'Workload Data Entry'!E636","v":0}]
[null,null,null,null,null,null,"Workload-Individual-TestsInHouse-Q1-23-13","Tests In-House - Molecular Tests - Other Molecular Test 7",{"$f":"'Workload Data Entry'!E637","v":0}]
[null,null,null,null,null,null,"Workload-Individual-TestsInHouse-Q1-23-14","Tests In-House - Molecular Tests - Other Molecular Test 8",{"$f":"'Workload Data Entry'!E638","v":0}]
[null,null,null,null,null,null,"Workload-Individual-TestsInHouse-Q1-23-15","Tests In-House - Molecular Tests - Other Molecular Test 9",{"$f":"'Workload Data Entry'!E639","v":0}]
[null,null,null,null,null,null,"Workload-Individual-TestsInHouse-Q1-23-16","Tests In-House - Molecular Tests - Other Molecular Test 10",{"$f":"'Workload Data Entry'!E640","v":0}]
[null,null,null,null,null,null,"Workload-Individual-TestsInHouse-Q1-23-17","Tests In-House - Molecular Tests - Total Molecular Tests",{"$f":"'Workload Data Entry'!E641","v":0}]
[null,null,null,null,null,null,"Workload-Individual-TestsInHouse-Q1-24-1","Tests In-House - Remaining Other Tests - Chemistry",{"$f":"'Workload Data Entry'!E644","v":0}]
[null,null,null,null,null,null,"Workload-Individual-TestsInHouse-Q1-24-2","Tests In-House - Remaining Other Tests - Haematology (Incl Blood Transfusion)",{"$f":"'Workload Data Entry'!E646","v":0}]
[null,null,null,null,null,null,"Workload-Individual-TestsInHouse-Q1-24-3","Tests In-House - Remaining Other Tests - Immunology",{"$f":"'Workload Data Entry'!E647","v":0}]
[null,null,null,null,null,null,"Workload-Individual-TestsInHouse-Q1-24-4","Tests In-House - Remaining Other Tests - Combined Blood Sciences",{"$f":"'Workload Data Entry'!E648","v":0}]
[]
[null,null,null,null,null,null,null,"Organisation Name:",{"$f":"'General Information'!C5","v":"Please provide your organisation name"}]
[null,null,null,null,null,null,null,"Department/Discipline:",{"$f":"'General Information'!C6","v":"Chemistry"}]
[null,null,null,null,null,null,null,"Name:",{"$f":"'General Information'!C9","v":"Please provide the name of the primary contact person for this questionnaire"}]
[null,null,null,null,null,null,null,"Job Title:",{"$f":"'General Information'!C10","v":"Please provide the job title of the primary contact person for this questionnaire"}]
[null,null,null,null,null,null,null,"Email Address:",{"$f":"'General Information'!C11","v":"yourname@your-emailaddress.net"}]
[null,null,null,null,null,null,null,"Telephone Number:",{"$f":"'General Information'!C12","v":"01234 567890"}]