{"text_format":"1","workbook":"xlsx","n_sheets":11,"sheets":["General Information","Summary Data Sense Check Sheet","Workload Guidance Notes","Workload Data Entry","Staffing and Finance Guidance","Staffing and Finance Data Entry","AfC Spine Data","lists","Turnaround Times","Consultant Pay","Data Export"],"not_rendered":{"charts":0,"images":9,"macros":1,"external_links":0,"defined_names":23,"comments":0,"pivot_tables":0},"unopened":[],"bounds":{"document_bytes":16777216,"sheet_cells":100000,"rows_first":2000,"rows_last":500,"rows_between":2000,"halvings":0,"cell_chars":16384,"cell_head_chars":4096},"cells_cut":0,"cells_raw":0,"read":"whole","date_system":"1900"}

{"sheet":"General Information","index":0,"n_rows":41,"n_cols":3,"rows_kept":41,"cut":false,"hidden":false,"merged":[[19,1,19,2],[29,1,29,2],[31,1,31,2],[21,1,21,2],[40,1,40,2],[23,1,23,2],[25,1,25,2],[26,1,26,2],[27,1,27,2],[18,1,18,2],[1,1,1,2],[2,1,2,2],[14,1,14,2],[16,1,16,2],[17,1,17,2]]}
[]
[null,"TBP Laboratory Benchmarking Questionnaire - Clinical Biochemistry"]
[null,"General Information and Contact Details"]
[]
[null,"Organisation Name:","Please provide your organisation name"]
[null,"Department/Discipline:","Chemistry"]
[]
[null,"Details For Primary Contact Person For This Questionnaire:"]
[null,"Name:","Please provide the name of the primary contact person for this questionnaire"]
[null,"Job Title:","Please provide the job title of the primary contact person for this questionnaire"]
{"$rows_left_out":32}
{"sheet":"Summary Data Sense Check Sheet","index":1,"n_rows":25,"n_cols":5,"rows_kept":25,"cut":false,"hidden":false,"merged":[[2,1,2,4],[1,1,1,4]]}
[]
[null,{"$f":"'General Information'!B2:C2","v":"TBP Laboratory Benchmarking Questionnaire - Clinical Biochemistry"}]
[null,"Summary Data - Sense Checking"]
[]
[null,"Workload Volume","Total Tests (Including Referred Out)","Tests Referred Out","Tests In-House (Calculated)"]
[null,"Total \"Traditional\" Chemistry Tests",{"$f":"SUM('Workload Data Entry'!C225,'Workload Data Entry'!C240,'Workload Data Entry'!C288,'Workload Data Entry'!C310,'Workload Data Entry'!C342,'Workload Data Entry'!C360,'Workload Data Entry'!C644)","v":0},{"$f":"SUM('Workload Data Entry'!D225,'Workload Data Entry'!D240,'Workload Data Entry'!D288,'Workload Data Entry'!D310,'Workload Data Entry'!D342,'Workload Data Entry'!D360,'Workload Data Entry'!D644)","v":0},{"$f":"SUM('Workload Data Entry'!E225,'Workload Data Entry'!E240,'Workload Data Entry'!E288,'Workload Data Entry'!E310,'Workload Data Entry'!E342,'Workload Data Entry'!E360,'Workload Data Entry'!E644)","v":0}]
[null,"Total \"Traditional\" Immunology Tests",{"$f":"SUM('Workload Data Entry'!C454,'Workload Data Entry'!C463,'Workload Data Entry'!C472,'Workload Data Entry'!C490,'Workload Data Entry'!C504,'Workload Data Entry'!C507,'Workload Data Entry'!C645)","v":0},{"$f":"SUM('Workload Data Entry'!D454,'Workload Data Entry'!D463,'Workload Data Entry'!D472,'Workload Data Entry'!D490,'Workload Data Entry'!D504,'Workload Data Entry'!D507,'Workload Data Entry'!D645)","v":0},{"$f":"SUM('Workload Data Entry'!E454,'Workload Data Entry'!E463,'Workload Data Entry'!E472,'Workload Data Entry'!E490,'Workload Data Entry'!E504,'Workload Data Entry'!E507,'Workload Data Entry'!E645)","v":0}]
[null,"Total \"Traditional\" Haematology and Blood Transfusion Tests",{"$f":"SUM('Workload Data Entry'!C523,'Workload Data Entry'!C533,'Workload Data Entry'!C557,'Workload Data Entry'!C563,'Workload Data Entry'!C579,'Workload Data Entry'!C593,'Workload Data Entry'!C599,'Workload Data Entry'!C605,'Workload Data Entry'!C616,'Workload Data Entry'!C622,'Workload Data Entry'!C641,'Workload Data Entry'!C646)","v":0},{"$f":"SUM('Workload Data Entry'!D523,'Workload Data Entry'!D533,'Workload Data Entry'!D557,'Workload Data Entry'!D563,'Workload Data Entry'!D579,'Workload Data Entry'!D593,'Workload Data Entry'!D599,'Workload Data Entry'!D605,'Workload Data Entry'!D616,'Workload Data Entry'!D622,'Workload Data Entry'!D641,'Workload Data Entry'!D646)","v":0},{"$f":"SUM('Workload Data Entry'!E523,'Workload Data Entry'!E533,'Workload Data Entry'!E557,'Workload Data Entry'!E563,'Workload Data Entry'!E579,'Workload Data Entry'!E593,'Workload Data Entry'!E599,'Workload Data Entry'!E605,'Workload Data Entry'!E616,'Workload Data Entry'!E622,'Workload Data Entry'!E641,'Workload Data Entry'!E646)","v":0}]
[null,"Total Any Other/Non-Defined Tests",{"$f":"SUM('Workload Data Entry'!C648)","v":0},{"$f":"SUM('Workload Data Entry'!D648)","v":0},{"$f":"SUM('Workload Data Entry'!E648)","v":0}]
[null,"Total Tests",{"$f":"SUM(C6:C9)","v":0},{"$f":"SUM(D6:D9)","v":0},0]
{"$rows_left_out":16}
{"sheet":"Workload Guidance Notes","index":2,"n_rows":96,"n_cols":2,"rows_kept":96,"cut":false,"hidden":false,"merged":[[92,1,92,6],[36,1,36,6],[45,1,45,6],[53,1,53,6],[59,1,59,6],[69,1,69,6],[74,1,74,6],[79,1,79,6],[80,1,80,6],[83,1,83,6],[85,1,85,6],[90,1,90,6],[31,1,31,6],[1,1,1,6],[2,1,2,6],[4,1,4,6],[5,1,5,6],[8,1,8,6],[6,1,6,6],[13,1,13,6],[11,1,11,6],[23,1,23,6],[25,1,25,6],[28,1,28,6]]}
[]
[null,{"$f":"'General Information'!B2:C2","v":"TBP Laboratory Benchmarking Questionnaire - Clinical Biochemistry"}]
[null,"Workload Guidance Notes"]
[]
[null,"Individual tests data are once again being collected at individual disicpline level (ie separate questionnaire and workload matrix for each discipline).  We have provided a complete \"Blood Sciences\" test list for each individual discipline, even though many of these tests will not be performed in the department for which you are completing this questionnaire.  This is because different laboratories operate different multi-disciplinary ways of working, and we wish to allow for any potential combination of tests performed across each department."]
[null,"However, you should only account for tests performed in your department (ie the department to which this questionnaire relates), and should always include any staff and non-pay costs (within scope) included with performing that workload within this questionnaire.  Please do not worry about double-counting across multiple questionnaires at this stage; our data checking system will flag up to you where tests may have been double counted, and will work with you to ensure that any combined calculations of data in your final reports do not include double counting."]
[null,"Total tests values given should cover the total performed during the latest financial year (1st April 2019 to 31st March 2020)"]
[]
[null,"The use of requests and/or tests as unweighted units of workload measurement varies between departments.  Even the definitions of requests and tests vary between departments as well as within departments.  However, on-going development with significant input from our user groups and specialty panels have identified the most commonly used definitions of 'request' and 'test' and they are stated below.  Workload measurements will never be a flawless comparison across different departments, but these are the closest definitions available and will provide a useful and informative comparison of workload volume when analysed appropriately."]
[]
{"$rows_left_out":87}
{"sheet":"Workload Data Entry","index":3,"n_rows":648,"n_cols":5,"rows_kept":648,"cut":false,"hidden":false,"merged":[[24,1,24,4],[18,1,18,4],[1,1,1,4],[19,1,19,4],[15,1,15,4],[3,1,3,4],[17,1,17,4]]}
[]
[null,{"$f":"'General Information'!B2:C2","v":"TBP Laboratory Benchmarking Questionnaire - Clinical Biochemistry"}]
[]
[null,"Source of Workload"]
[]
[null,"Source of Workload"]
[null,"Hospitals/laboratories within your overall Trust/Organisation",0]
[null,"Other NHS hospitals/laboratories within your network",0]
[null,"Other NHS hospitals/laboratories outside your network",0]
[null,"Private/non-NHS work",0]
{"$rows_left_out":639}
{"sheet":"Staffing and Finance Guidance","index":4,"n_rows":101,"n_cols":9,"rows_kept":101,"cut":false,"hidden":false,"merged":[[100,8,107,14],[81,8,81,14],[84,1,84,14],[86,1,86,14],[88,1,88,14],[91,8,98,14],[99,8,99,14],[77,8,80,14],[42,8,42,14],[44,1,44,14],[46,1,46,14],[48,1,48,14],[50,8,53,14],[55,1,55,14],[58,8,59,14],[60,8,60,14],[61,8,62,14],[63,8,67,14],[68,8,76,14],[26,8,29,14],[32,1,32,14],[35,1,35,14],[37,1,37,14],[39,8,41,14],[21,8,24,14],[2,1,2,14],[1,1,1,14],[4,1,4,14],[6,8,9,14],[11,8,13,14],[14,8,14,14],[16,8,19,14]]}
[]
[null,{"$f":"'General Information'!B2:C2","v":"TBP Laboratory Benchmarking Questionnaire - Clinical Biochemistry"}]
[null,"Inputting Your Staffing and Non-Pay Data"]
[]
[null,"Finance Data Configuration"]
[]
[null,null,null,null,null,null,null,null,"You will begin by configuring the 'Finance' options, which will apply modifiers to your salaries and also allow you to enter your non-pay value.  \"On Costs\" are set to 26% by default, which is a standard contribution made towards things such as pensions and payroll tax."]
[]
[]
[]
{"$rows_left_out":92}
{"sheet":"Staffing and Finance Data Entry","index":5,"n_rows":74,"n_cols":23,"rows_kept":74,"cut":false,"hidden":false,"merged":[[73,2,73,15],[4,2,4,15],[2,2,2,15],[21,4,23,4],[21,5,23,15],[26,5,26,14],[62,4,66,15],[5,2,5,15],[34,18,34,22],[33,18,33,22],[1,2,1,15],[69,2,69,15],[70,2,70,15]]}
["DO NOT INSERT OR REMOVE ROWS OR COLUMNS"]
[null,null,{"$f":"'General Information'!B2","v":"TBP Laboratory Benchmarking Questionnaire - Clinical Biochemistry"}]
[null,null,"Staffing and Finance Data"]
[]
[null,null,"This year we have taken significant steps to both streamline the data collection process and also deliver more comparable data in your final reports.  For this reason we no longer require you to provide salaries data from your finance department, and have instead built a new system for helping you to calculating salaries based on national standards and pay scale definitions.  There are a series of options provided that will allow you to generate a salary profile for your workforce that will provide an accurate calculation of salaries, but will also allow us the ability to provide 'normalised' pay cost analyses within your reports (in addition to \"actual vs actual\").  In other words, your report will also be able to show you the impact that 'having a staffing profile the same as yours' (in terms of things like on-costs, HCAS, level of experience/time in post for key staff, etc) would have on the cost efficiency of the rest of your peer group."]
[null,null,"For a full tutorial on how to complete this section please refer to the guidance notes"]
[]
[null,null,"Finance Configuration"]
[null,null,"On-Cost Percentage",0.26,"<<<","Enter on-cost value here ('typical' = 26%)"]
[null,null,"Apply High Cost Area Supplement (HCAS)","None","<<<","Applies AfC High Cost Area Supplement costs to mid-point salaries (previously referred to as \"London Weighting\")"]
{"$rows_left_out":65}
{"sheet":"AfC Spine Data","index":6,"n_rows":94,"n_cols":22,"rows_kept":94,"cut":false,"hidden":true,"merged":[[87,2,93,2],[3,2,5,2],[6,2,13,2],[14,2,21,2],[22,2,29,2],[30,2,38,2],[39,2,48,2],[49,2,58,2],[59,2,65,2],[66,2,72,2],[73,2,79,2],[80,2,86,2]]}
[null,null,null,null,null,null,null,null,null,null,"Selected Data"]
[null,null,null,null,null,null,null,null,null,null,"HCAS"]
[null,null,"Band","Previous spine point","Minimum years of experience","2019/20 annual value (£)","including Inner London HCAS","including Outer London HCAS","including Fringe HCAS",null,{"$f":"'Staffing and Finance Data Entry'!D10","v":"None"},"With on-costs","Modifier 2","Final Figure",null,"Band","Term","CON lookup","Salary",null,null,"Trainees Reduction Salary Value"]
[null,null,"Band 1",2,"< 1 year",17652,22052,21374,18669,null,{"$f":"IF(K$3=\"None\",$F4,IF(K$3=$G$3,$G4,IF(K$3=$H$3,$H4,IF(K$3=$I$3,$I4,$F4))))","v":17652},{"$f":"SUM(K4,SUM(K4*'Staffing and Finance Data Entry'!$D$9))","v":22241.52},{"$f":"L4","v":22241.52},{"$f":"M4","v":22241.52},null,1,"<1 Year",{"$f":"CONCATENATE(P4,\"-\",Q4)","v":"1-<1 Year"},{"$f":"N4","v":22241.52},null,"Medical Trainees",{"$f":"IF('Staffing and Finance Data Entry'!$D$25=\"Yes\",'Staffing and Finance Data Entry'!D22,100%)","v":1}]
[null,null,null,null,"Default",{"$f":"F4","v":17652},{"$f":"G4","v":22052},21374,18669,null,{"$f":"IF(K$3=\"None\",$F5,IF(K$3=$G$3,$G5,IF(K$3=$H$3,$H5,IF(K$3=$I$3,$I5,$F5))))","v":17652},{"$f":"SUM(K5,SUM(K5*'Staffing and Finance Data Entry'!$D$9))","v":22241.52},{"$f":"L5","v":22241.52},22241.52,null,1,"Default",{"$f":"CONCATENATE(P5,\"-\",Q5)","v":"1-Default"},{"$f":"N5","v":22241.52},null,"Clinical Scientist Trainees",{"$f":"IF('Staffing and Finance Data Entry'!$D$25=\"Yes\",'Staffing and Finance Data Entry'!D23,100%)","v":1}]
[null,null,null,3,"1+ years",17652,22052,21374,18669,null,17652,{"$f":"SUM(K6,SUM(K6*'Staffing and Finance Data Entry'!$D$9))","v":22241.52},22241.52,22241.52,null,1,"1+ Years","1-1+ Years",22241.52,null,"Biomedical Scientist Trainnes",{"$f":"IF('Staffing and Finance Data Entry'!$D$25=\"Yes\",'Staffing and Finance Data Entry'!D24,100%)","v":1}]
[null,null,"Band 2",2,"< 1 year ",17652,22052,21374,18669,null,17652,{"$f":"SUM(K7,SUM(K7*'Staffing and Finance Data Entry'!$D$9))","v":22241.52},22241.52,22241.52,null,2,"<1 Year","2-<1 Year",22241.52]
[null,null,null,3,"1 - 2 years",17652,22052,21374,18669,null,17652,{"$f":"SUM(K8,SUM(K8*'Staffing and Finance Data Entry'!$D$9))","v":22241.52},22241.52,22241.52,null,2,"1-2 Years","2-1-2 Years",22241.52]
[null,null,null,4,"2 - 3 years",17652,22052,21374,18669,null,17652,{"$f":"SUM(K9,SUM(K9*'Staffing and Finance Data Entry'!$D$9))","v":22241.52},22241.52,22241.52,null,2,"2-3 Years","2-2-3 Years",22241.52]
[null,null,null,5,"3 - 4 years",17652,22052,21374,18669,null,17652,{"$f":"SUM(K10,SUM(K10*'Staffing and Finance Data Entry'!$D$9))","v":22241.52},22241.52,22241.52,null,2,"3-4 Years","2-3-4 Years",22241.52]
{"$rows_left_out":85}
{"sheet":"lists","index":7,"n_rows":164,"n_cols":22,"rows_kept":164,"cut":false,"hidden":true,"merged":[]}
[null,null,null,null,null,null,null,null,null,null,"Experience Level"]
[null,"Complexity","Staff Cost Modifier",null,null,"Discipline","Disc No","Disc Codes","Source of Workload Lookup",null,"Band 1","Bands 2-4","Band 5","Bands 6-7","Bands 8a+",null,"HCAS","Diagnostics","Consultants","Consultants Clinical Excellence","SpR Profiles","Other Medical Staff"]
[null,"9 (Highest)","+0.0%",1.0000000000000084,null,"Chemistry",1,"CH",{"$f":"G3","v":1},null,"Default","Default","Default","Default","Default",null,"None","Not Selected","Default (Mid Point)","Exclude","Default (Mid Point)","Default (Mid Point)"]
[null,"8 (Top Decile)","+40.0%",1.4,null,"Haematology",2,"HA",{"$f":"G4","v":2},null,"<1 Year","<1 Year","<1 Year","<1 Year","<1 Year",null,"including Inner London HCAS","Siemens","2003 Contract: (starting salary)","Default (Mid Point)","Min: £31,841","AfC1"]
[null,"7 (Top Quartile)","+39.5%",1.395,null,"Immunology",3,"IM",3,null,"1+ Years","1-2 Years","1-2 Years","1-2 Years","1-2 Years",null,"including Outer London HCAS","Others","2003 Contract: (1 year completed as consultan","Level 1","1: £33,790","AfC2"]
[null,"6 (Just Above Average)","+39.0%",1.3900000000000001,null,"Combined Blood Sciences",4,"BS",5,null,null,"2-3 Years","2-3 Years","2-3 Years","2-3 Years",null,"including Fringe HCAS",null,"2003 Contract: (2 years completed)","Level 2","2: £36,511","AfC3"]
[null,"5 (Average)","+38.5%",1.3850000000000002,null,"Microbiology",5,"MI",4,null,null,"3-4 Years","3-4 Years","3-4 Years","3-4 Years",null,null,null,"2003 Contract: (3 years completed)","Level 3","3: £38,156","AfC4"]
[null,"4 (Just Below Average)","+38.0%",1.3800000000000003,null,"Cellular Pathology",6,"HC",8,null,null,"4-5 Years","4-5 Years","4-5 Years","4-5 Years",null,null,null,"2003 Contract: (4-8 years completed)","Level 4","4: £40,141","AfC5"]
[null,"3 (Lower Quartile)","+37.5%",1.3750000000000004,null,"Histopathology",7,"HI",6,null,null,"5-6 Years","5-6 Years","5-6 Years","5+ Years",null,null,null,"2003 Contract: (9-13 years completed)","Level 5","5: £42,126","AfC6"]
[null,"2 (Lower Decile)","+37.0%",1.3700000000000006,null,"Cytology",8,"CY",7,null,null,"6+ Years","6-7 Years","6-7 Years",null,null,null,null,"2003 Contract: (14-18 years completed)","Level 6","6: £44,112","AfC7"]
{"$rows_left_out":155}
{"sheet":"Turnaround Times","index":8,"n_rows":20,"n_cols":3,"rows_kept":20,"cut":false,"hidden":false,"merged":[[1,1,1,2],[2,1,2,2],[4,1,4,2],[5,1,5,2],[7,1,7,2]]}
[]
[null,{"$f":"'General Information'!B2:C2","v":"TBP Laboratory Benchmarking Questionnaire - Clinical Biochemistry"}]
[null,"Turnaround Times"]
[]
[null,"Please use data taken from 1st January 2020 to 31st March 2020."]
[null,"The following questions relate to the turnaroud times section of the Royal College of Pathologists KPI document."]
[null,"These inform CPA standard G1 and ISO15189:2012 standards 4.4.1 and 4.14.1.  The percentage of specified investigations from A&E completed within one hour of sample collection should be recorded and published, however not all laboratories are able to access data relating to sample collection.  We have therefore used two 'start points' in the following questions, and request that participants complete both where possible.   For clarification, we define the end point as \"the authorised result being made available to the requestor\"."]
[null,"For reference, the target set by the RCPath (for \"vein to result\") is 90% within 60 minutes."]
[]
[null,"A&E Requests for U&E (or equivalent)"]
{"$rows_left_out":11}
{"sheet":"Consultant Pay","index":9,"n_rows":49,"n_cols":14,"rows_kept":49,"cut":false,"hidden":true,"merged":[]}
[]
[null,null,"2003 Contract",null,null,"Pre 2003",null,null,"Clinical Excellence Awards",null,null,null,"SPR"]
[null,null,"1 (starting salary)",79860,null,"Basic",66306,null,"Level","Clinical excellence awards £",null,null,"Min",31841]
[null,null,"2 (1 year completed as consultant)",82361,null,1,71051,null,"Level 1",3016,null,null,1,33790]
[null,null,"3 (2 years completed)",84862,null,2,75796,null,"Level 2",6032,null,null,2,36511]
[null,null,"4 (3 years completed)",87362,null,3,80541,null,"Level 3",9048,null,null,3,38156]
[null,null,"5 (4-8 years completed)",89856,null,4,85951,null,"Level 4",12064,null,null,4,40141]
[null,null,"6 (9-13 years completed)",95795,null,null,null,null,"Level 5",15080,null,null,5,42126]
[null,null,"7 (14-18 years completed)",101735,null,null,null,null,"Level 6",18096,null,null,6,44112]
[null,null,"8 (19 years completed)",107668,null,null,null,null,"Level 7",24128,null,null,7,46096]
{"$rows_left_out":40}
{"sheet":"Data Export","index":10,"n_rows":2264,"n_cols":9,"rows_kept":2264,"cut":false,"hidden":true,"merged":[]}
[]
[null,null,null,null,"Selected Disc Code:","CH"]
[null,null,null,null,null,null,null,null,"Selected Lab"]
[null,null,"Import Number","AfC Import","Raw Code","Salary Calc","Final Code","Descriptor","E000"]
[null,null,null,null,null,null,null,"LOOKUP",4]
[null,null,1,4,"Staffing-Total-Q1",null,{"$f":"CONCATENATE($F$2,\"-\",E6)","v":"CH-Staffing-Total-Q1"},"Total FTE - Medical Consultant",{"$f":"IF(ISERROR(VLOOKUP($C6,'Staffing and Finance Data Entry'!$A$30:$P$60,$D6,FALSE))=TRUE,\"XXX\",IF(VLOOKUP($C6,'Staffing and Finance Data Entry'!$A$30:$P$60,$D6,FALSE)=0,\"XXX\",VLOOKUP($C6,'Staffing and Finance Data Entry'!$A$30:$P$60,$D6,FALSE)))","v":"XXX"}]
[null,null,2,4,"Staffing-Total-Q2",null,{"$f":"CONCATENATE($F$2,\"-\",E7)","v":"CH-Staffing-Total-Q2"},"Total FTE - Locum Consultants",{"$f":"IF(ISERROR(VLOOKUP($C7,'Staffing and Finance Data Entry'!$A$30:$P$60,$D7,FALSE))=TRUE,\"XXX\",IF(VLOOKUP($C7,'Staffing and Finance Data Entry'!$A$30:$P$60,$D7,FALSE)=0,\"XXX\",VLOOKUP($C7,'Staffing and Finance Data Entry'!$A$30:$P$60,$D7,FALSE)))","v":"XXX"}]
[null,null,3,4,"Staffing-Total-Q3",null,"CH-Staffing-Total-Q3","Total FTE - Junior Doctors/Specialty Trainees (Specialist Registrar/SpR) - Internally Funded",{"$f":"IF(ISERROR(VLOOKUP($C8,'Staffing and Finance Data Entry'!$A$30:$P$60,$D8,FALSE))=TRUE,\"XXX\",IF(VLOOKUP($C8,'Staffing and Finance Data Entry'!$A$30:$P$60,$D8,FALSE)=0,\"XXX\",SUM(VLOOKUP($C8,'Staffing and Finance Data Entry'!$A$30:$P$60,$D8,FALSE)*'Staffing and Finance Data Entry'!$D$22)))","v":"XXX"}]
[null,null,4,4,"Staffing-Total-Q4",null,"CH-Staffing-Total-Q4","Total FTE - Junior Doctors/Specialty Trainees (Specialist Registrar/SpR) - Externally Funded",{"$f":"IF(ISERROR(VLOOKUP($C9,'Staffing and Finance Data Entry'!$A$30:$P$60,$D9,FALSE))=TRUE,\"XXX\",IF(VLOOKUP($C9,'Staffing and Finance Data Entry'!$A$30:$P$60,$D9,FALSE)=0,\"XXX\",SUM(VLOOKUP($C9,'Staffing and Finance Data Entry'!$A$30:$P$60,$D9,FALSE)*'Staffing and Finance Data Entry'!$D$22)))","v":"XXX"}]
[null,null,5,4,"Staffing-Total-Q6",null,"CH-Staffing-Total-Q6","Total FTE - Remaining Other Medical Staff",{"$f":"IF(ISERROR(VLOOKUP($C10,'Staffing and Finance Data Entry'!$A$30:$P$60,$D10,FALSE))=TRUE,\"XXX\",IF(VLOOKUP($C10,'Staffing and Finance Data Entry'!$A$30:$P$60,$D10,FALSE)=0,\"XXX\",VLOOKUP($C10,'Staffing and Finance Data Entry'!$A$30:$P$60,$D10,FALSE)))","v":"XXX"}]
{"$rows_left_out":2254}